{"text_format":"1","workbook":"xlsx","n_sheets":13,"sheets":["（計算方法）","試算シートの使い方","入力シート","印刷シート ","支給率シート","H30.4.1","【参考】調整額区分表","給料表計算シート","R7給料表","R6給料表","（除算）","（基本額式）","（7割措置）"],"not_rendered":{"charts":0,"images":12,"macros":1,"external_links":1,"defined_names":82,"comments":5,"pivot_tables":0},"unopened":[],"bounds":{"document_bytes":16777216,"sheet_cells":100000,"rows_first":2000,"rows_last":500,"rows_between":2000,"halvings":0,"cell_chars":16384,"cell_head_chars":4096},"cells_cut":0,"cells_raw":0,"read":"whole","date_system":"1900"}

{"sheet":"（計算方法）","index":0,"n_rows":12,"n_cols":13,"rows_kept":12,"cut":false,"hidden":true,"merged":[[2,1,2,3],[2,5,2,7],[2,9,2,10],[2,12,2,13],[5,4,5,13],[11,4,11,13],[3,11,3,13],[7,1,7,2],[11,1,11,2],[5,1,5,2]]}
[]
[]
["※","退職手当の給料月額",null,null,"＝","本俸（給料表の月額）",null,null,"＋","教職調整額",null,"＋","給料の調整額"]
[null,null,null,null,null,null,null,null,null,null,null,"（福利厚生ハンドブック　26貢参照）"]
[]
[null,"本俸",null,"・・・・・","給料表上の月額です。"]
[]
[null,"教職調整額",null,"・・・・・","校長（県立） ３，８００円 （小中） ４，０００円 ／ 副校長・教頭 １１，５００円 ／教諭　給料表上の月額×５％ （R8.4.1現在）"]
[null,null,null,null,"※満60歳年度末年月日が R7.3.31 の場合は、以下のとおりとなります。"]
[null,null,null,null,"　副校長・教頭（県立）７，７００円 ／ 副校長・教頭（小中）７，５００円 ／ 教諭　給料表上の月額×４％"]
[]
[null,"給料の調整額",null,"・・・・・","特別支援学校（学級）に従事する教員が該当します。 調整基本額×１．００（R8.4.1現在）"]

{"sheet":"試算シートの使い方","index":1,"n_rows":82,"n_cols":8,"rows_kept":82,"cut":false,"hidden":false,"merged":[[64,1,64,8],[65,1,65,8],[62,0,62,8],[79,1,79,2],[9,1,9,8],[0,0,0,8],[3,1,3,5],[5,1,5,5],[8,1,8,8],[1,7,1,8],[4,1,4,5]]}
["退職手当試算シート【定年・定年扱い退職者用】の使用について"]
[null,null,null,null,null,null,null,"R8.4.1 現在"]
["１　用意するもの"]
["（１）"," 履歴書"]
["（２）"," 給与明細（満６０歳年度内最新のもの）"]
["（３）"," 給与明細（退職年度内最新のもの）"]
[]
["２　使用方法"]
["（１）"," 入力シートを開きます。"]
["（２）"," 入力シートの説明を参考に履歴書等を見ながら該当箇所に入力してください。"]
[]
["　　　 ※　不明な点は、所属の事務職員に確認するか、福利課企画管理班まで御連絡く"]
["　　　　　　ださい。（022-211-3672）"]
[]
[]
[]
[]
[]
[]
[]
{"$rows_left_out":63}
{"sheet":"入力シート","index":2,"n_rows":175,"n_cols":81,"rows_kept":175,"cut":false,"hidden":false,"merged":[[19,68,20,72],[19,53,20,56],[132,37,133,44],[126,37,127,44],[128,37,129,44],[76,58,77,64],[76,20,77,32],[1,1,1,64],[43,72,43,77],[44,72,44,77],[19,66,20,66],[28,48,28,57],[29,48,29,52],[29,53,29,55],[29,56,29,61],[29,62,29,65],[35,48,35,57],[36,48,36,52],[36,53,36,55],[36,56,36,61],[36,62,36,65],[39,65,39,69],[39,61,39,64],[39,47,39,60],[70,20,70,36],[136,52,137,57],[76,1,77,13],[152,52,153,57],[157,31,158,47],[157,48,158,60],[152,58,153,63],[76,39,77,51],[76,52,77,55],[75,1,75,17],[84,1,84,62],[102,59,103,62],[157,61,158,64],[128,45,129,48],[130,37,131,44],[130,25,131,30],[132,25,133,30],[130,45,131,48],[132,45,133,48],[122,1,122,64],[126,45,127,48],[126,25,127,30],[71,1,73,16],[72,39,73,51],[159,55,159,58],[159,46,159,54],[152,64,153,64],[154,55,155,63],[154,64,155,64],[67,20,68,24],[67,25,68,27],[67,28,68,32],[67,52,68,55],[83,1,83,62],[85,1,85,62],[75,39,75,55],[67,1,68,17],[72,20,73,24],[72,25,73,27],[72,28,73,32],[70,39,70,55],[76,14,77,17],[76,33,77,36],[123,1,123,64],[72,52,73,55],[75,20,75,36],[72,33,73,36],[72,17,72,19],[44,22,45,26],[44,27,45,28],[44,5,45,14],[66,39,66,47],[67,39,68,47],[66,1,66,17],[67,33,68,36],[40,80,41,80],[40,79,41,79],[40,78,41,78],[40,77,41,77],[43,44,44,56],[45,44,46,56],[43,32,45,43],[46,32,46,43],[40,47,40,60],[40,61,40,64],[43,15,43,28],[66,20,66,36],[44,15,45,19],[45,64,46,65],[44,20,45,21],[48,1,48,64],[32,74,33,76],[33,65,33,69],[32,65,32,69],[32,70,32,73],[33,70,33,73],[39,74,40,76],[39,70,39,73],[40,65,40,69],[40,70,40,73],[31,15,31,28],[29,5,29,14],[32,61,32,64],[33,61,33,64],[32,29,32,42],[32,47,32,60],[32,15,32,25],[32,26,32,28],[28,15,28,28],[29,29,29,32],[29,33,29,46],[32,5,32,14],[33,29,33,42],[33,47,33,60],[2,39,2,47],[13,1,14,13],[2,52,2,63],[12,1,12,64],[13,16,13,53],[14,16,14,64],[19,15,20,28],[19,61,20,64],[19,49,20,52],[6,1,6,57],[9,1,10,13],[8,1,8,13],[19,35,20,48],[19,1,20,14],[19,57,20,60],[4,1,4,64],[71,20,71,36],[71,39,71,55],[128,31,129,36],[79,1,79,17],[79,20,79,36],[79,39,79,55],[80,1,81,13],[80,14,81,17],[80,20,81,32],[80,33,81,36],[80,39,81,51],[80,52,81,55],[126,31,127,36],[80,58,81,64],[144,37,145,42],[144,43,145,50],[142,31,143,36],[144,16,145,23],[144,24,145,30],[144,1,145,15],[35,5,35,14],[35,15,35,28],[36,5,36,14],[36,15,36,28],[36,29,36,32],[36,33,36,46],[38,15,38,28],[39,29,39,42],[40,5,40,14],[39,26,39,28],[39,15,39,25],[39,5,39,14],[40,15,40,25],[40,26,40,28],[40,29,40,42],[130,31,131,36],[132,31,133,36],[134,31,135,36],[136,31,137,36],[134,37,135,44],[136,37,137,44],[138,37,139,44],[134,45,135,48],[138,45,139,48],[138,25,139,30],[138,31,139,36],[134,25,135,30],[136,25,137,30],[139,66,139,70],[160,31,160,64],[138,55,139,63],[138,64,139,64],[136,58,137,63],[136,64,137,64],[154,43,155,50],[150,43,151,50],[152,43,153,50],[154,31,155,36],[154,37,155,42],[150,31,151,36],[150,37,151,42],[152,31,153,36],[152,37,153,42],[146,37,147,42],[146,43,147,50],[148,31,149,36],[148,37,149,42],[148,43,149,50],[146,31,147,36],[142,37,143,42],[142,43,143,50],[144,31,145,36],[146,24,147,30],[148,24,149,30],[150,24,151,30],[152,24,153,30],[154,24,155,30],[138,16,139,24],[126,1,127,15],[128,1,129,15],[130,1,131,15],[132,1,133,15],[134,1,135,15],[136,1,137,15],[138,1,139,15],[142,24,143,30],[142,16,143,23],[142,1,143,15],[126,16,127,24],[128,16,129,24],[130,16,131,24],[132,16,133,24],[134,16,135,24],[136,16,137,24],[128,25,129,30],[146,1,147,15],[148,1,149,15],[150,1,151,15],[152,1,153,15],[154,1,155,15],[146,16,147,23],[148,16,149,23],[150,16,151,23],[152,16,153,23],[154,16,155,23],[21,61,22,64],[21,68,22,72],[19,73,20,76],[21,73,22,76],[21,66,22,66],[44,67,44,69],[43,64,44,65],[43,57,44,63],[45,57,46,63],[25,1,25,64],[26,1,26,64],[29,15,29,28],[33,5,33,14],[33,26,33,28],[33,15,33,25],[23,1,24,14],[23,15,24,28],[21,1,22,14],[21,15,22,28],[21,35,22,48],[21,49,22,52],[21,53,22,56],[21,57,22,60],[28,5,28,14],[106,65,107,71],[101,1,101,25],[102,23,103,25],[102,1,103,22],[101,29,101,53],[102,29,103,50],[102,51,103,53],[105,1,105,25],[105,29,105,53],[106,1,107,22],[106,23,107,25],[106,29,107,50],[106,51,107,53],[106,59,107,62],[102,65,103,71]]}
[]
[null,"退職手当試算入力シート【定年・定年扱い退職者用】"]
[null,null,null,null,null,null,null,null,null,null,null,null,null,null,null,null,null,null,null,null,null,null,null,null,null,null,null,null,null,null,null,null,null,null,null,null,null,null,null,"入力箇所(必須）",null,null,null,null,null,null,null,null,null,null,null,null,"入力箇所（場合によって）"]
[]
[null,"こちらのシートは、定年引上げ後の定年扱い退職年度に退職される方の、おおよその退職手当額を試算します。\n正確な退職手当額は昇給等を考慮した上で決定されることとなりますので、参考程度にお考えください。\n黄色セル、（場合によっては）青色セルに入力してください。"]
[]
[1,"試算希望者の氏名を入力してください。"]
[]
[null,"氏　　名"]
[null,"福　花子"]
[]
[]
[2,"退職事由を選んでください。（プルダウンから選択してください。）"]
[null,"定年扱い",null,null,null,null,null,null,null,null,null,null,null,null,null,null,"※退職事由によって退職手当額が大きく異なります。"]
[null,null,null,null,null,null,null,null,null,null,null,null,null,null,null,null,"※退職年月日が６０歳の誕生日以降であれば、定年を選んでください。"]
[]
[2,"採用年月日、満60歳年度末及び退職年月日を入力してください。"]
[null,"また、休職等除算期間がある場合には入力してください。"]
[]
[null,"採用年月日",null,null,null,null,null,null,null,null,null,null,null,null,null,"1991-04-01",null,null,null,null,null,null,null,null,null,null,null,null,null,null,null,null,null,null,null,"満60歳年度末勤続期間",null,null,null,null,null,null,null,null,null,null,null,null,null,{"$f":"TRUNC(IF(MONTH(P22)<MONTH(P20),(YEAR(P22)-YEAR(P20))*12+MONTH(P22)-MONTH(P20)+1,(YEAR(P22)-YEAR(P20))*12+MONTH(P22)-MONTH(P20)+1)/12)","v":35},null,null,null,"年",null,null,null,{"$f":"MOD(IF(MONTH(P22)<MONTH(P20),(YEAR(P22)-YEAR(P20))*12+MONTH(P22)-MONTH(P20)+1,(YEAR(P22)-YEAR(P20))*12+MONTH(P22)-MONTH(P20)+1),12)","v":0},null,null,null,"月",null,null,null,null,"a",null,{"$f":"(YEAR(P22)-YEAR(P20))*12+MONTH(P22)-MONTH(P20)+1","v":420},null,null,null,null,"満60歳"]
{"$rows_left_out":156}
{"sheet":"印刷シート ","index":3,"n_rows":42,"n_cols":39,"rows_kept":42,"cut":false,"hidden":false,"merged":[[36,2,36,5],[36,6,36,8],[37,2,37,5],[37,6,37,8],[38,6,38,8],[39,6,39,8],[8,14,8,20],[40,6,40,8],[41,6,41,8],[33,6,33,8],[34,6,34,8],[35,6,35,8],[30,6,30,8],[31,6,31,8],[32,6,32,8],[28,19,29,22],[24,1,25,4],[24,5,24,13],[25,15,25,16],[25,12,25,14],[25,9,25,10],[25,5,25,7],[21,21,21,22],[10,14,10,17],[1,16,1,20],[1,21,1,22],[2,10,2,11],[2,16,2,20],[7,12,7,13],[1,1,2,9],[1,10,1,11],[4,1,7,1],[4,2,5,4],[6,2,6,4],[7,2,7,4],[4,5,4,13],[6,12,6,13],[5,12,5,13],[6,5,6,11],[7,5,7,11],[3,14,3,22],[3,5,3,13],[6,21,6,22],[7,14,7,20],[7,21,7,22],[4,14,5,22],[3,1,3,4],[1,12,1,15],[2,12,2,15],[22,1,23,4],[22,5,23,18],[22,19,23,22],[10,19,11,19],[10,21,11,21],[12,21,13,21],[14,21,15,21],[16,21,17,21],[12,19,13,19],[9,14,9,20],[9,21,9,22],[20,1,21,4],[20,12,20,13],[20,5,20,11],[20,14,20,20],[20,21,20,22],[21,5,21,8],[12,3,18,4],[16,20,17,20],[14,22,15,22],[16,19,17,19],[6,14,6,20],[21,18,21,20],[10,20,11,20],[10,22,11,22],[11,14,11,17],[14,16,15,18],[14,20,15,20],[15,14,15,15],[12,20,13,20],[12,22,13,22],[21,12,21,13],[12,16,13,18],[16,22,17,22],[14,19,15,19],[8,21,8,22],[13,14,13,15],[30,1,35,1],[5,9,5,11],[5,5,5,7],[10,10,11,10],[10,12,11,12],[26,1,27,4],[28,1,29,4],[28,5,29,18],[14,5,14,11],[14,12,14,13],[15,5,15,11],[15,12,15,13],[12,5,12,11],[13,5,13,11],[9,12,9,13],[9,1,9,4],[10,3,11,4],[8,2,8,4],[10,5,10,8],[11,5,11,8],[21,14,21,17],[10,1,19,2],[9,5,9,11],[21,9,21,11],[8,25,8,26],[18,10,18,18],[26,5,26,22],[27,16,27,17],[27,5,27,6],[27,8,27,9],[27,11,27,12],[27,14,27,15],[27,18,27,19],[27,21,27,22],[16,5,16,11],[16,12,16,13],[16,16,17,18],[17,5,17,11],[17,12,17,13],[17,14,17,15],[12,12,12,13],[13,12,13,13],[10,11,11,11],[10,13,11,13],[8,5,8,11],[8,12,8,13]]}
[]
[null,"退職手当計算内訳書　（試算）",null,null,null,null,null,null,null,null,"氏名：",null,{"$f":"IF(入力シート!B10=\"\",\"\",入力シート!B10)","v":"福　花子"},null,null,null,{"$f":"TODAY()","v":"2026-08-10"},null,null,null,null,"現在",null,null,null,null,null,null,null,{"$f":"IF(入力シート!B14=\"自己都合\",\"自己都合\",IF(入力シート!B14=\"定年扱い\",\"定年扱い\"))","v":"定年扱い"}]
[null,null,null,null,null,null,null,null,null,null,"事由：",null,{"$f":"$AD$2&\"退職\"","v":"定年扱い退職"}]
[null,"給与等",null,null,null,"満60歳年度の給料月額",null,null,null,null,null,null,null,null,"退職時の給料月額"]
[null,"給料月額","級号俸",null,null,{"$f":"入力シート!B68","v":"教育（一）"}]
[null,null,null,null,null,{"$f":"IF(入力シート!U68=\"\",\"\",IF(F7=入力シート!AN73,入力シート!U73,入力シート!U68))","v":4},null,null,"級",{"$f":"IF(入力シート!AC68=\"\",\"\",IF(F7=入力シート!AN73,入力シート!AC73,入力シート!AC68))","v":21},null,null,"号俸"]
[null,null,"給料",null,null,{"$f":"入力シート!$B$77+入力シート!$B$103","v":496800},null,null,null,null,null,null,"円",null,{"$f":"入力シート!$B$81+入力シート!$B$107","v":347800},null,null,null,null,null,null,"円"]
[null,null,"教職調整額",null,null,{"$f":"入力シート!$U$77+入力シート!$AD$103","v":3800},null,null,null,null,null,null,"円",null,{"$f":"入力シート!$U$81+入力シート!$AD$107","v":17390},null,null,null,null,null,null,"円"]
[null,null,"給料の調整額",null,null,{"$f":"入力シート!AN77","v":0},null,null,null,null,null,null,"円",null,{"$f":"入力シート!AN81","v":0},null,null,null,null,null,null,"円",null,null,{"$f":"K11*12+M11","v":420},{"$f":"T11*12+V11","v":432}]
[null,"　　計",null,null,null,{"$f":"SUM(F7:L9)","v":500600},null,null,null,null,null,null,"円（Ａ）",null,{"$f":"SUM(O7:U9)","v":365190},null,null,null,null,null,null,"円（Ｂ）"]
[null,"　勤続年数",null,"在職年数（ア）",null,{"$f":"入力シート!P20","v":"1991-04-01"},null,null,null,"から",{"$f":"入力シート!$AX$20","v":35},"年",{"$f":"入力シート!$BF$20","v":0},"月",{"$f":"入力シート!P20","v":"1991-04-01"},null,null,null,"から",{"$f":"入力シート!$AX$22","v":36},"年",{"$f":"入力シート!$BF$22","v":0},"月",null,{"$f":"SUM(T13:T18)","v":1},"除算年計"]
[null,null,null,null,null,{"$f":"入力シート!P22","v":"2026-03-31"},null,null,null,"まで",null,null,null,null,{"$f":"入力シート!P24","v":"2027-03-31"},null,null,null,"まで",null,null,null,null,null,{"$f":"ROUNDDOWN((Y15)/12,0)","v":0}]
[null,null,null,"除算年数（イ）",null,{"$f":"IF(AND(入力シート!$AW$30=0,入力シート!$BE$30=0),\"\",入力シート!AD33)","v":"1994-03-01"},null,null,null,null,null,null,"から",null,null,null,{"$f":"IF(F13=\"\",\"\",\"育休\")","v":"育休"},null,null,{"$f":"IF(Q13=\"\",\"\",入力シート!AW30)","v":0},"年",{"$f":"IF(Q13=\"\",\"\",入力シート!BE30)","v":4.8},"月",null,{"$f":"MOD(Y15,12)","v":7.8}]
[null,null,null,null,null,{"$f":"IF(AND(入力シート!$AW$30=0,入力シート!$BE$30=0),\"\",入力シート!AV34)","v":"1995-03-31"},null,null,null,null,null,null,"まで",null,"（１）"]
[null,null,null,null,null,{"$f":"IF(AND(入力シート!$AW$37=0,入力シート!$BE$37=0),\"\",入力シート!AD40)","v":"2020-02-01"},null,null,null,null,null,null,"から",null,null,null,{"$f":"IF(F15=\"\",\"\",入力シート!$P$36)","v":"休職"},null,null,{"$f":"IF(Q15=\"\",\"\",入力シート!AW37)","v":0},"年",{"$f":"IF(Q15=\"\",\"\",入力シート!BE37)","v":1},"月",null,{"$f":"SUM(V13:V18)","v":7.8},"除算月計"]
[null,null,null,null,null,{"$f":"IF(AND(入力シート!AW37,入力シート!BE37=0),\"\",入力シート!AV40)","v":"2020-03-31"},null,null,null,null,null,null,"まで",null,"（２）"]
[null,null,null,null,null,"さらに除く年月数",null,null,null,null,null,null,null,null,null,null,{"$f":"IF(F17=\"\",\"\",\"その他\")","v":"その他"},null,null,{"$f":"IF(Q17=\"\",\"\",入力シート!P45)","v":1},"年",{"$f":"IF(Q17=\"\",\"\",入力シート!W45)","v":2},"月"]
[null,null,null,null,null,null,null,null,null,null,null,null,null,null,"（３）",null,null,null,null,null,null,null,null,null,{"$f":"Y9-(Y13+(Y11+Y12)*12)","v":400.2},null,{"$f":"Z9-(Y13+(Y11+Y12)*12)","v":412.2}]
[null,null,null,null,null,null,null,"計",null,null,null,null,null,null,null,null,null,null,null,{"$f":"+Y11+Y12","v":1},"年",{"$f":"Y13","v":7.8},"月"]
[null,null,null,"　合計（ウ）＝（ア）－（イ）",null,null,null,null,null,null,{"$f":"IF(Y20>0,Y20,0)","v":33},"年",{"$f":"IF(Z20>0,Z20,0)","v":4.1999999999999886},"月",null,null,null,null,null,{"$f":"IF(AA20>0,AA20,0)","v":34},"年",{"$f":"IF(AB20>0,AB20,0)","v":4.1999999999999886},"月",null,{"$f":"ROUNDDOWN(Y18/12,0)","v":33},{"$f":"Y18-Y20*12","v":4.1999999999999886},{"$f":"ROUNDDOWN(AA18/12,0)","v":34},{"$f":"AA18-AA20*12","v":4.1999999999999886}]
{"$rows_left_out":23}
{"sheet":"支給率シート","index":4,"n_rows":41,"n_cols":14,"rows_kept":41,"cut":false,"hidden":true,"merged":[[4,3,4,5],[4,9,4,10],[36,3,36,9],[45,3,45,14],[38,0,38,6],[20,3,20,9],[12,3,12,14],[14,3,14,15],[16,3,16,14]]}
["支給率算定シート"]
[null,null,null,null,null,null,null,null,null,null,null,null,"自己都合"]
[]
[]
[null,null,null,"※１勤続年数",null,null,null,null,null,"支給率"]
[null,null,null,null,"満60歳年度",{"$f":"'印刷シート '!K20","v":33},null,null,null,"満60歳年度",{"$f":"IF(F9=1,VLOOKUP($F$6,'H30.4.1'!A5:C50,3,FALSE),VLOOKUP($F$6,'H30.4.1'!A5:C50,2,FALSE))","v":45.323550000000004}]
[null,null,null,null,"退職時",{"$f":"'印刷シート '!T20","v":34},null,null,null,"退職時",{"$f":"IF(F9=1,VLOOKUP($F$7,'H30.4.1'!A6:C51,3,FALSE),VLOOKUP($F$7,'H30.4.1'!A6:C51,2,FALSE))","v":46.830150000000003}]
[null,null,null,"退職区分"]
[null,null,null,{"$f":"入力シート!B14","v":"定年扱い"},null,{"$f":"IF(D9=\"自己都合\",1,2)","v":2}]
[]
[]
[]
[null,null,null,"※１）　育児休業、休職等の期間を除いた年数"]
[]
[null,null,null,"　　　　１年未満の端数は切り捨て　例）３５年６月　→３５年"]
[]
[]
[]
[]
[]
{"$rows_left_out":22}
{"sheet":"H30.4.1","index":5,"n_rows":50,"n_cols":3,"rows_kept":50,"cut":false,"hidden":true,"merged":[[1,1,1,2],[1,0,3,0],[2,1,3,1],[2,2,3,2]]}
["支給率"]
[" 年  数","退職事由"]
[null,"定年","自己都合"]
[]
[0,null,0]
[1,0.83700000000000008,0.50219999999999998]
[2,1.6740000000000002,1.0044]
[3,2.5110000000000001,1.5065999999999999]
[4,3.3480000000000003,2.0087999999999999]
[5,4.1849999999999996,2.5110000000000001]
[6,5.0220000000000002,3.0131999999999999]
[7,5.859,3.5154000000000001]
[8,6.6960000000000006,4.0175999999999998]
[9,7.5330000000000004,4.5198]
[10,8.3699999999999992,5.0220000000000002]
[11,11.613375000000001,7.4325600000000005]
[12,12.764249999999999,8.1691199999999977]
[13,13.915125,8.9056800000000003]
[14,15.066000000000001,9.642240000000001]
[15,16.216875000000002,10.378800000000002]
{"$rows_left_out":31}
{"sheet":"【参考】調整額区分表","index":6,"n_rows":44,"n_cols":11,"rows_kept":44,"cut":false,"hidden":false,"merged":[]}
["退職手当の調整額に関する区分表"]
[]
["イ　１９年３月３１日までの適用区分"]
["区分","第１号","第２号","第３号","第４号","第５号","第６号","第７号","第８号","第９号","第１０号"]
["調整月額",78750,70400,65000,59550,54150,43350,32500,27100,21700,0]
["行政職",null,null,"１１級\n期20%","１０級\n期20%","９級\n期15%","８級\n期15%","７級\n期10%","６級\n期10%","５級・４級\n期5%","３級・２級・１級"]
["教育職(二)",null,null,null,"４級\n期20%","４級\n管16%・管14%\n期15%","４級\n期15%","３級　期10%\n２級期10%のうち注８の者","２級\n期10%","２級・１級\n期5%","２級・１級"]
["教育職(三)",null,null,null,"４級\n期20%","４級\n管16%・管14%\n期15%","４級\n期15%","３級　期10%\n２級期10%のうち注８の者","２級\n期10%","２級\n期5%","２級・１級"]
["研究職",null,null,"５級\n管25%\n期20%","５級\n期20%","４級\n管18%\n期15%","４級 期15%\n３級のうち注４の職","３級のうち注５の職","３級\n期10%","２級\n期5%","２級・１級"]
["医療職(二)\n医療職(三)",null,null,null,null,"７級\n期15%","６級\n期15%","５級のうち注６の職","５級\n期10%","４級  期5%\n３級　期5%","3級・2級・1級"]
["技能職",null,null,null,null,null,null,null,"５級\n期10%","４級  期5%\n３級　期5%\n２級　期5%","４級・３級・\n２級・１級"]
[]
["ロ　１９年４月１日から21年３月31日までの適用区分"]
["区分","第１号","第２号","第３号","第４号","第５号","第６号","第７号","第８号","第９号","第１０号"]
["調整月額",78750,70400,65000,59550,54150,43350,32500,27100,21700,0]
["行政職",null,"１０級\n期20%","９級\n期20%","８級\n期20%","７級\n期15%","６級\n期15%","５級\n期10%","４級\n期10%","３級\n期5%","２級・１級"]
["教育職(二)",null,null,null,"４級\n期20%","４級\n管６種\n期15%","４級\n期15%","３級　期10%\n２級期10%のうち注８の者","２級\n期10%","２級・１級\n期5%","２級・１級"]
["教育職(三)",null,null,null,"４級\n期20%","４級\n管６種\n期15%","４級\n期15%","３級　期10%\n２級期10%のうち注８の者","２級\n期10%","２級\n期5%","２級・１級"]
["研究職",null,null,"５級\n管１種\n期20%","５級\n期20%","４級\n管４種\n期15%","４級 期15%\n３級のうち注４の職","３級のうち注５の職","３級\n期10%","２級\n期5%","２級・１級"]
["医療職(二)\n医療職(三)",null,null,null,null,"７級\n期15%","６級\n期15%","５級のうち注７の職","５級\n期10%","４級  期5%\n３級　期5%","3級・2級・1級"]
{"$rows_left_out":25}
{"sheet":"給料表計算シート","index":7,"n_rows":25,"n_cols":7,"rows_kept":25,"cut":false,"hidden":true,"merged":[[11,1,11,3],[20,1,20,3]]}
["１　現在の給料表"]
[]
[null,null,null,null,"給料月額","調整額","給料表コード"]
["行政",{"$f":"IF(入力シート!$B$68=\"行政\",入力シート!$B$68,\"\")","v":""},{"$f":"IF(B4=\"\",\"\",入力シート!$U$68)","v":""},{"$f":"IF(B4=\"\",\"\",入力シート!$AC$68)","v":""},{"$f":"IF(B4=\"\",\"\",IF($E$14=DATE(2026,3,31),VLOOKUP($D$16,'R7給料表'!$B$2:$C$4268,2,FALSE),IF($E$14=DATE(2025,3,31),VLOOKUP($D$16,'R6給料表'!$B$2:$C$4268,2,FALSE),\"\")))","v":""},{"$f":"IF(B4=\"\",\"\",IF($E$14=DATE(2026,3,31),VLOOKUP($D$17,'R7給料表'!$F$2:$G$50,2,FALSE),IF($E$14=DATE(2025,3,31),VLOOKUP($D$17,'R6給料表'!$F$2:$G$50,2,FALSE),\"\")))","v":""},{"$f":"IF(B4=\"\",\"\",1)","v":""}]
["教育（一）",{"$f":"IF(入力シート!$B$68=\"教育（一）\",入力シート!$B$68,\"\")","v":"教育（一）"},{"$f":"IF(B5=\"\",\"\",入力シート!$U$68)","v":4},{"$f":"IF(B5=\"\",\"\",入力シート!$AC$68)","v":21},{"$f":"IF(B5=\"\",\"\",IF($E$14=DATE(2026,3,31),VLOOKUP($D$16,'R7給料表'!$B$2:$C$4268,2,FALSE),IF($E$14=DATE(2025,3,31),VLOOKUP($D$16,'R6給料表'!$B$2:$C$4268,2,FALSE),\"\")))","v":496800},{"$f":"IF(B5=\"\",\"\",IF($E$14=DATE(2026,3,31),VLOOKUP($D$17,'R7給料表'!$F$2:$G$50,2,FALSE),IF($E$14=DATE(2025,3,31),VLOOKUP($D$17,'R6給料表'!$F$2:$G$50,2,FALSE),\"\")))","v":13300},{"$f":"IF(B5=\"\",\"\",4)","v":4}]
["教育（二）",{"$f":"IF(入力シート!$B$68=\"教育（二）\",入力シート!$B$68,\"\")","v":""},{"$f":"IF(B6=\"\",\"\",入力シート!$U$68)","v":""},{"$f":"IF(B6=\"\",\"\",入力シート!$AC$68)","v":""},{"$f":"IF(B6=\"\",\"\",IF($E$14=DATE(2026,3,31),VLOOKUP($D$16,'R7給料表'!$B$2:$C$4268,2,FALSE),IF($E$14=DATE(2025,3,31),VLOOKUP($D$16,'R6給料表'!$B$2:$C$4268,2,FALSE),\"\")))","v":""},{"$f":"IF(B6=\"\",\"\",IF($E$14=DATE(2026,3,31),VLOOKUP($D$17,'R7給料表'!$F$2:$G$50,2,FALSE),IF($E$14=DATE(2025,3,31),VLOOKUP($D$17,'R6給料表'!$F$2:$G$50,2,FALSE),\"\")))","v":""},{"$f":"IF(B6=\"\",\"\",5)","v":""}]
["研究",{"$f":"IF(入力シート!$B$68=\"研究\",入力シート!$B$68,\"\")","v":""},{"$f":"IF(B7=\"\",\"\",入力シート!$U$68)","v":""},{"$f":"IF(B7=\"\",\"\",入力シート!$AC$68)","v":""},{"$f":"IF(B7=\"\",\"\",IF($E$14=DATE(2026,3,31),VLOOKUP($D$16,'R7給料表'!$B$2:$C$4268,2,FALSE),IF($E$14=DATE(2025,3,31),VLOOKUP($D$16,'R6給料表'!$B$2:$C$4268,2,FALSE),\"\")))","v":""},{"$f":"IF(B7=\"\",\"\",IF($E$14=DATE(2026,3,31),VLOOKUP($D$17,'R7給料表'!$F$2:$G$39,2,FALSE),IF($E$14=DATE(2025,3,31),VLOOKUP($D$17,'R6給料表'!$F$2:$G$39,2,FALSE),\"\")))","v":""},{"$f":"IF(B7=\"\",\"\",6)","v":""}]
["技能",{"$f":"IF(入力シート!$B$68=\"技能\",入力シート!$B$68,\"\")","v":""},{"$f":"IF(B8=\"\",\"\",入力シート!$U$68)","v":""},{"$f":"IF(B8=\"\",\"\",入力シート!$AC$68)","v":""},{"$f":"IF(B8=\"\",\"\",IF($E$14=DATE(2026,3,31),VLOOKUP($D$16,'R7給料表'!$B$2:$C$4268,2,FALSE),IF($E$14=DATE(2025,3,31),VLOOKUP($D$16,'R6給料表'!$B$2:$C$4268,2,FALSE),\"\")))","v":""},{"$f":"IF(B8=\"\",\"\",IF($E$14=DATE(2026,3,31),VLOOKUP($D$17,'R7給料表'!$F$2:$G$39,2,FALSE),IF($E$14=DATE(2025,3,31),VLOOKUP($D$17,'R6給料表'!$F$2:$G$39,2,FALSE),\"\")))","v":""},{"$f":"IF(B8=\"\",\"\",10)","v":""}]
["医療（二）",{"$f":"IF(入力シート!$B$68=\"医療（二）\",入力シート!$B$68,\"\")","v":""},{"$f":"IF(B9=\"\",\"\",入力シート!$U$68)","v":""},{"$f":"IF(B9=\"\",\"\",入力シート!$AC$68)","v":""},{"$f":"IF(B9=\"\",\"\",IF($E$14=DATE(2026,3,31),VLOOKUP($D$16,'R7給料表'!$B$2:$C$4268,2,FALSE),IF($E$14=DATE(2025,3,31),VLOOKUP($D$16,'R6給料表'!$B$2:$C$4268,2,FALSE),\"\")))","v":""},{"$f":"IF(B9=\"\",\"\",IF($E$14=DATE(2026,3,31),VLOOKUP($D$17,'R7給料表'!$F$2:$G$39,2,FALSE),IF($E$14=DATE(2025,3,31),VLOOKUP($D$17,'R6給料表'!$F$2:$G$39,2,FALSE),\"\")))","v":""},{"$f":"IF(B9=\"\",\"\",8)","v":""}]
["医療（三）",{"$f":"IF(入力シート!$B$68=\"医療（三）\",入力シート!$B$68,\"\")","v":""},{"$f":"IF(B10=\"\",\"\",入力シート!$U$68)","v":""},{"$f":"IF(B10=\"\",\"\",入力シート!$AC$68)","v":""},{"$f":"IF(B10=\"\",\"\",IF($E$14=DATE(2026,3,31),VLOOKUP($D$16,'R7給料表'!$B$2:$C$4268,2,FALSE),IF($E$14=DATE(2025,3,31),VLOOKUP($D$16,'R6給料表'!$B$2:$C$4268,2,FALSE),\"\")))","v":""},{"$f":"IF(B10=\"\",\"\",IF($E$14=DATE(2026,3,31),VLOOKUP($D$17,'R7給料表'!$F$2:$G$39,2,FALSE),IF($E$14=DATE(2025,3,31),VLOOKUP($D$17,'R6給料表'!$F$2:$G$39,2,FALSE),\"\")))","v":""},{"$f":"IF(B10=\"\",\"\",9)","v":""}]
[]
[null,"給料月額",null,null,{"$f":"MAX(E4:E10)","v":496800},{"$f":"MAX(F4:F10)","v":13300}]
[null,"給与表コード","級","号俸","満60歳年度末年月日"]
[null,{"$f":"SUM(G4:G10)","v":4},{"$f":"SUM(C4:C10)","v":4},{"$f":"SUM(D4:D10)","v":21},{"$f":"入力シート!P22","v":"2026-03-31"}]
[]
["給料表",{"$f":"TEXT(B14,\"0\")&TEXT(C14,\"00\")&TEXT(D14,\"000\")","v":"404021"},null,{"$f":"B16*1","v":404021}]
["調整額",{"$f":"TEXT(B14,\"0\")&TEXT(C14,\"00\")","v":"404"},null,{"$f":"B17*1","v":404}]
[null,null,null,null,"給料月額","調整額","給料表コード"]
["技能 H27",{"$f":"IF(OR(入力シート!U73=\"\",入力シート!AC73=\"\"),\"\",\"技能\")","v":""},{"$f":"IF(B19=\"\",\"\",入力シート!$U$73)","v":""},{"$f":"IF(B19=\"\",\"\",入力シート!$AC$73)","v":""},{"$f":"IF(B19=\"\",\"\",VLOOKUP($D$25,'R7給料表'!B:D,3,0))","v":""},null,{"$f":"IF(B19=\"\",\"\",10)","v":""}]
[]
{"$rows_left_out":6}
{"sheet":"R7給料表","index":8,"n_rows":4252,"n_cols":8,"rows_kept":4252,"cut":false,"hidden":true,"merged":[]}
["2025-04-01","表級号","金額",null,"調整額","表級","金額"]
["給料表",101001,197400,null,"基本額表",101,6700]
[null,101002,198500,null,null,102,8600]
[null,101003,199700,null,null,103,9800]
[null,101004,200800,null,null,104,10500]
[null,101005,201900,null,null,105,10800]
[null,101006,203600,null,null,106,11400]
[null,101007,205300,null,null,107,12300]
[null,101008,206900,null,null,108,13000]
[null,101009,208400,null,null,109,14700]
[null,101010,210100,null,null,110,16300,"行政職"]
[null,101011,211700,null,null,401,9100]
[null,101012,213300,null,null,402,11300]
[null,101013,214800,null,null,425,11700]
[null,101014,216600,null,null,403,12400]
[null,101015,218300,null,null,404,13300,"教育職（１）"]
[null,101016,220000,null,null,501,8600]
[null,101017,221100,null,null,502,11100]
[null,101018,222700,null,null,525,11400]
[null,101019,224300,null,null,503,12000]
{"$rows_left_out":4233}
{"sheet":"R6給料表","index":9,"n_rows":4268,"n_cols":8,"rows_kept":4268,"cut":false,"hidden":true,"merged":[]}
["2024-04-01","表級号","金額",null,"調整額","表級","金額"]
["給料表",101001,185000,null,"基本額表",101,6700]
[null,101002,186100,null,null,102,8600]
[null,101003,187300,null,null,103,9800]
[null,101004,188400,null,null,104,10500]
[null,101005,189500,null,null,105,10800]
[null,101006,191200,null,null,106,11400]
[null,101007,192900,null,null,107,12300]
[null,101008,194500,null,null,108,13000]
[null,101009,196100,null,null,109,14700]
[null,101010,197800,null,null,110,16300,"行政職"]
[null,101011,199400,null,null,401,9100]
[null,101012,201000,null,null,402,11300]
[null,101013,202600,null,null,425,11700]
[null,101014,204400,null,null,403,12400]
[null,101015,206100,null,null,404,13300,"教育職（１）"]
[null,101016,207800,null,null,501,8600]
[null,101017,209100,null,null,502,11100]
[null,101018,210700,null,null,525,11400]
[null,101019,212300,null,null,503,12000]
{"$rows_left_out":4249}
{"sheet":"（除算）","index":10,"n_rows":8,"n_cols":4,"rows_kept":8,"cut":false,"hidden":true,"merged":[[5,1,6,2],[5,3,6,11],[7,1,9,2],[7,3,9,11],[1,3,4,11],[1,1,4,2]]}
[]
[null,"〇休職\n〇停職\n〇大学院修学休業\n〇育児休業",null,"　月の初日から末日まで勤務しない月が１月以上あったときは、その月数の２分の１\n　　（例）休職期間　平成２５年２月１４日～平成２６年２月１３日の場合\n　　　平成２５年３月　～　平成２６年１月までの　１１月×１/２＝５．５月が除算となる\n　※ただし、育児休業の場合は、当該育児休業に係る子が１歳に達した日の属する月まで\n　の期間については、その月数の３分の１"]
[]
[]
[]
[null,"〇高齢者部分休業の期間",null,"　７時間４５分をもって１日とし、３０日をもって１月として換算した月数の２分の１"]
[]
[null,"〇組合専従の期間\n〇自己啓発等休業\n〇配偶者同行休業",null,"　月の初日から末日まで勤務しない月が１月以上あったときは、その月数の全部の月数\n　※ただし、自己啓発等休業のうち、公務運営に特に資するものと認められること等要件に\n　該当する場合は、その月数の２分の１"]

{"sheet":"（基本額式）","index":11,"n_rows":6,"n_cols":2,"rows_kept":6,"cut":false,"hidden":true,"merged":[[15,27,20,30],[5,1,7,4]]}
[]
[]
[]
[]
[]
[null,"退職手当\nの基本額"]

{"sheet":"（7割措置）","index":12,"n_rows":12,"n_cols":38,"rows_kept":12,"cut":false,"hidden":true,"merged":[[5,0,5,3],[16,27,19,30]]}
[]
[]
[]
[]
[]
[]
[]
[null,null,null,null,null,null,null,null,null,null,null,null,null,null,null,null,null,null,null,null,null,null,null,null,null,null,null,null,null,null,null,null,null,null,null,null,null,"別の図を組み合わせている箇所"]
[null,null,null,null,null,null,null,null,null,null,null,null,null,null,null,null,null,null,null,null,null,null,null,null,null,null,null,null,null,null,null,null,null,null,null,null,null,"・「６０歳」と吹き出し"]
[null,null,null,null,null,null,null,null,null,null,null,null,null,null,null,null,null,null,null,null,null,null,null,null,null,null,null,null,null,null,null,null,null,null,null,null,null,"・「退職時」と吹き出し"]
[null,null,null,null,null,null,null,null,null,null,null,null,null,null,null,null,null,null,null,null,null,null,null,null,null,null,null,null,null,null,null,null,null,null,null,null,null,"・「勤続年数に」と「応じた支給率」"]
[null,null,null,null,null,null,null,null,null,null,null,null,null,null,null,null,null,null,null,null,null,null,null,null,null,null,null,null,null,null,null,null,null,null,null,null,null,"・「支給率■」と「ア」及び「イ」"]