{"text_format":"1","workbook":"xlsx","n_sheets":10,"sheets":["試算シートの使い方","入力シート","印刷シート","支給率シート","【参考】調整額区分表","給料表計算シート","R7給料表","（除算）","（計算方法）","H30.4.1"],"not_rendered":{"charts":0,"images":8,"macros":1,"external_links":1,"defined_names":51,"comments":3,"pivot_tables":0},"unopened":[],"bounds":{"document_bytes":16777216,"sheet_cells":100000,"rows_first":2000,"rows_last":500,"rows_between":2000,"halvings":0,"cell_chars":16384,"cell_head_chars":4096},"cells_cut":0,"cells_raw":0,"read":"whole","date_system":"1900"}

{"sheet":"試算シートの使い方","index":0,"n_rows":81,"n_cols":8,"rows_kept":81,"cut":false,"hidden":false,"merged":[[63,1,63,8],[64,1,64,8],[61,0,61,8],[78,1,78,2],[8,1,8,8],[0,0,0,8],[3,1,3,5],[4,1,4,5],[7,1,7,8],[1,7,1,8]]}
["退職手当試算シートの使用について"]
[null,null,null,null,null,null,null,"R8.4.1 現在"]
["１　用意するもの"]
["（１）"," 履歴書"]
["（２）"," 給与明細（最新のもの）"]
[]
["２　使用方法"]
["（１）"," 入力シートを開きます。"]
["（２）"," 入力シートの説明を参考に履歴書等を見ながら該当箇所に入力してください。"]
[]
["　　　 ※　不明な点は、所属の事務職員に確認するか、福利課企画管理班まで御連絡く"]
["　　　　　　ださい。（022-211-3672）"]
[]
[]
[]
[]
[]
[]
[]
[]
{"$rows_left_out":62}
{"sheet":"入力シート","index":1,"n_rows":163,"n_cols":81,"rows_kept":163,"cut":false,"hidden":false,"merged":[[18,68,19,72],[18,53,19,56],[18,57,19,60],[120,37,121,44],[114,37,115,44],[116,37,117,44],[116,31,117,36],[124,17,125,24],[42,72,42,77],[43,72,43,77],[18,66,19,66],[25,48,25,57],[26,48,26,52],[26,53,26,55],[26,56,26,61],[26,62,26,65],[33,48,33,57],[34,48,34,52],[34,53,34,55],[34,56,34,61],[34,62,34,65],[37,65,37,69],[37,61,37,64],[37,47,37,60],[38,47,38,60],[38,61,38,64],[38,65,38,69],[67,20,67,36],[124,52,125,57],[73,1,74,13],[140,52,141,57],[69,39,70,51],[145,31,146,47],[145,48,146,60],[140,58,141,63],[73,39,74,51],[73,52,74,55],[72,1,72,17],[77,1,77,62],[94,1,94,17],[94,20,94,36],[94,39,94,55],[95,1,96,13],[95,14,96,17],[95,20,96,32],[95,33,96,36],[95,39,96,51],[95,52,96,55],[95,58,96,64],[145,61,146,64],[118,37,119,44],[68,39,68,55],[42,15,42,28],[63,20,63,36],[42,1,44,4],[43,15,44,19],[147,55,147,58],[147,46,147,54],[140,64,141,64],[142,55,143,63],[142,64,143,64],[64,20,65,24],[64,25,65,27],[64,28,65,32],[64,52,65,55],[76,1,76,62],[78,1,78,62],[72,39,72,55],[64,1,65,17],[69,20,70,24],[69,25,70,27],[69,28,70,32],[67,39,67,55],[73,14,74,17],[73,33,74,36],[43,20,44,21],[46,1,46,64],[43,22,44,26],[43,27,44,28],[43,5,44,14],[63,39,63,47],[64,39,65,47],[63,1,63,17],[42,61,43,64],[42,31,43,47],[42,48,43,60],[64,33,65,36],[38,80,39,80],[38,79,39,79],[38,78,39,78],[38,77,39,77],[29,74,30,76],[30,65,30,69],[29,65,29,69],[29,70,29,73],[30,70,30,73],[37,74,38,76],[37,70,37,73],[38,70,38,73],[22,1,22,64],[23,1,23,64],[26,15,26,28],[30,5,30,14],[30,26,30,28],[30,15,30,25],[25,5,25,14],[28,15,28,28],[26,5,26,14],[29,61,29,64],[30,61,30,64],[29,29,29,42],[29,47,29,60],[29,15,29,25],[29,26,29,28],[25,15,25,28],[26,29,26,32],[26,33,26,46],[29,5,29,14],[30,29,30,42],[30,47,30,60],[20,1,21,14],[1,39,1,47],[12,1,13,13],[1,52,1,63],[3,1,3,63],[11,1,11,64],[12,16,12,53],[13,16,13,64],[18,15,19,28],[18,61,19,64],[18,49,19,52],[5,1,5,57],[8,1,9,13],[7,1,7,13],[18,35,19,48],[18,1,19,14],[20,15,21,28],[120,15,121,16],[122,15,123,16],[124,15,125,16],[73,58,74,64],[73,20,74,32],[112,1,112,64],[69,52,70,55],[72,20,72,36],[69,33,70,36],[69,17,69,19],[118,25,119,30],[120,25,121,30],[111,1,111,64],[114,7,115,24],[114,25,115,30],[116,7,117,14],[116,17,117,24],[116,15,117,16],[68,1,70,16],[118,31,119,36],[120,31,121,36],[114,1,115,6],[118,1,119,6],[68,20,68,36],[120,1,121,6],[116,1,117,6],[120,7,121,14],[114,31,115,36],[118,7,119,14],[116,25,117,30],[118,17,119,24],[120,17,121,24],[33,5,33,14],[33,15,33,28],[34,5,34,14],[34,15,34,28],[34,29,34,32],[34,33,34,46],[36,15,36,28],[37,29,37,42],[38,5,38,14],[37,26,37,28],[37,15,37,25],[37,5,37,14],[38,15,38,25],[38,26,38,28],[38,29,38,42],[118,15,119,16],[136,7,137,12],[136,13,137,20],[136,21,137,22],[136,23,137,30],[136,31,137,36],[136,37,137,42],[136,43,137,50],[134,31,135,36],[130,37,131,42],[130,43,131,50],[132,7,133,12],[132,13,133,20],[132,21,133,22],[132,23,133,30],[132,31,133,36],[132,37,133,42],[132,43,133,50],[130,31,131,36],[122,7,123,14],[124,7,125,14],[124,1,125,6],[122,25,123,30],[124,25,125,30],[122,1,123,6],[122,17,123,24],[142,31,143,36],[142,37,143,42],[138,21,139,22],[138,23,139,30],[138,31,139,36],[138,37,139,42],[140,21,141,22],[140,23,141,30],[140,31,141,36],[140,37,141,42],[142,1,143,6],[138,7,139,12],[138,13,139,20],[140,7,141,12],[140,13,141,20],[134,7,135,12],[134,13,135,20],[122,31,123,36],[124,31,125,36],[122,37,123,44],[124,37,125,44],[126,37,127,44],[126,25,127,30],[126,31,127,36],[127,66,127,70],[148,31,148,64],[142,23,143,30],[134,37,135,42],[134,43,135,50],[126,1,127,6],[126,7,127,14],[126,15,127,16],[126,17,127,24],[126,55,127,63],[126,64,127,64],[124,58,125,63],[124,64,125,64],[142,43,143,50],[138,43,139,50],[140,43,141,50],[130,7,131,12],[130,13,131,30],[134,21,135,22],[134,23,135,30],[130,1,131,6],[132,1,133,6],[134,1,135,6],[136,1,137,6],[138,1,139,6],[140,1,141,6],[142,7,143,12],[142,13,143,20],[142,21,143,22]]}
[]
[null,"退職手当試算入力シート",null,null,null,null,null,null,null,null,null,null,null,null,null,null,null,null,null,null,null,null,null,null,null,null,null,null,null,null,null,null,null,null,null,null,null,null,null,"入力箇所(必須）",null,null,null,null,null,null,null,null,null,null,null,null,"入力箇所（場合によって）"]
[]
[null,"退職時のおおよその退職手当額を試算します。\n正確な退職手当額は昇給等を考慮した上で決定されることとなりますので、参考程度にお考えください。\n黄色セル、（場合によっては）青色セルに入力してください。"]
[]
[1,"試算希望者の氏名を入力してください。"]
[]
[null,"氏　　名"]
[null,"福　花子"]
[]
[]
[2,"退職事由を選んでください。（プルダウンから選択してください。）"]
[null,"定年扱い",null,null,null,null,null,null,null,null,null,null,null,null,null,null,"※退職事由によって退職手当額が大きく異なります。"]
[null,null,null,null,null,null,null,null,null,null,null,null,null,null,null,null,"※退職年月日が６０歳の誕生日以降であれば、定年扱いを選んでください。"]
[]
[3,"採用及び退職年月日を入力してください。"]
[null,"また、休職等除算期間がある場合には入力してください。"]
[]
[null,"採用年月日",null,null,null,null,null,null,null,null,null,null,null,null,null,"1991-04-01",null,null,null,null,null,null,null,null,null,null,null,null,null,null,null,null,null,null,null,"勤続期間",null,null,null,null,null,null,null,null,null,null,null,null,null,{"$f":"TRUNC(IF(MONTH(P21)<MONTH(P19),(YEAR(P21)-YEAR(P19))*12+MONTH(P21)-MONTH(P19)+1,(YEAR(P21)-YEAR(P19))*12+MONTH(P21)-MONTH(P19)+1)/12)","v":36},null,null,null,"年",null,null,null,{"$f":"MOD(IF(MONTH(P21)<MONTH(P19),(YEAR(P21)-YEAR(P19))*12+MONTH(P21)-MONTH(P19)+1,(YEAR(P21)-YEAR(P19))*12+MONTH(P21)-MONTH(P19)+1),12)","v":0},null,null,null,"月",null,null,null,null,"a",null,{"$f":"(YEAR(P21)-YEAR(P19))*12+MONTH(P21)-MONTH(P19)+1","v":432}]
[]
{"$rows_left_out":144}
{"sheet":"印刷シート","index":2,"n_rows":48,"n_cols":35,"rows_kept":48,"cut":false,"hidden":false,"merged":[[1,1,2,8],[31,5,33,7],[14,5,16,7],[14,8,16,8],[10,5,10,7],[31,8,33,8],[8,5,8,7],[11,5,11,7],[14,3,16,4],[7,5,7,7],[17,3,18,4],[31,1,33,4],[40,2,40,4],[41,2,41,4],[43,5,43,7],[44,5,44,7],[45,5,45,7],[41,5,41,7],[42,5,42,7],[28,9,28,10],[15,17,16,17],[38,5,38,7],[39,5,39,7],[40,5,40,7],[34,5,34,7],[35,5,35,7],[36,5,36,7],[37,5,37,7],[26,13,26,15],[17,5,18,7],[17,8,18,8],[20,13,20,14],[27,9,27,10],[20,5,20,7],[1,19,1,20],[1,14,1,18],[3,10,5,10],[6,10,16,10],[6,15,7,16],[2,14,2,18],[1,9,1,10],[2,9,2,10],[15,18,16,18],[15,19,16,19],[15,20,16,20],[8,15,9,16],[10,15,11,16],[12,15,13,16],[15,11,16,16],[14,11,14,13]]}
[]
[null,"退職手当計算内訳書　（試算）",null,null,null,null,null,null,null,"氏名：",null,{"$f":"IF(入力シート!B9=\"\",\"\",入力シート!B9)","v":"福　花子"},null,null,{"$f":"TODAY()","v":"2026-08-07"},null,null,null,null,"現在",null,null,null,null,null,null,null,{"$f":"IF(入力シート!B13=\"自己都合\",\"自己都合\",IF(入力シート!B13=\"定年扱い\",\"定年扱い\"))","v":"定年扱い"}]
[null,null,null,null,null,null,null,null,null,"事由：",null,{"$f":"$AB$2&\"退職\"","v":"定年扱い退職"}]
[null,"退","給",null,null,{"$f":"入力シート!B65","v":"教育（二）"},null,null,null,"勤","在職年数",{"$f":"入力シート!P19","v":"1991-04-01"},null,null,null,"から"]
[null,"職","料","級号俸",null,{"$f":"IF(入力シート!U65=\"\",\"\",IF(F8=入力シート!AN70,入力シート!U70,入力シート!U65))","v":3},"級",{"$f":"IF(入力シート!AC65=\"\",\"\",IF(F8=入力シート!AN70,入力シート!AC70,入力シート!AC65))","v":50},"号俸","続",null,{"$f":"入力シート!P21","v":"2027-03-31"},null,null,null,"まで",null,{"$f":"入力シート!$AX$19","v":36},"年",{"$f":"入力シート!$BF$19","v":0},"月"]
[null,"時","月",null,null,null,null,null,null,"年",null,"計(ｱ)",null,null,null,null,null,{"$f":"R5","v":36},"年",{"$f":"T5","v":0},"月",null,{"$f":"R6*12+T6","v":432}]
[null,"の","額",null,null,null,null,null,null,"数","除算年数",{"$f":"IF(AND(入力シート!$AW$27=0,入力シート!$BE$27=0),\"\",入力シート!AD30)","v":"1994-03-01"},"から",null,null,{"$f":"IF(L7=\"\",\"\",\"育休\")","v":"育休"}]
[null,"給",null,"給料(A)",null,{"$f":"入力シート!$B$74+入力シート!$B$96","v":423800},null,null,"円",null,null,{"$f":"IF(AND(入力シート!$AW$27=0,入力シート!$BE$27=0),\"\",入力シート!AV31)","v":"1995-03-31"},"まで",null,{"$f":"IF(P7=\"\",\"\",\"(1)\")","v":"(1)"},null,null,{"$f":"IF(P7=\"\",\"\",入力シート!AW27)","v":0},"年",{"$f":"IF(P7=\"\",\"\",入力シート!BE27)","v":4.8},"月"]
[null,"与",null,null,null,null,null,null,null,null,null,{"$f":"IF(AND(入力シート!$AW$35=0,入力シート!$BE$35=0),\"\",入力シート!AD38)","v":"2020-02-01"},"から",null,null,{"$f":"IF(L9=\"\",\"\",入力シート!$P$34)","v":"休職"}]
[null,"等",null,null,null,null,null,null,null,null,null,{"$f":"IF(AND(入力シート!AW35,入力シート!BE35=0),\"\",入力シート!AV38)","v":"2020-03-31"},"まで",null,{"$f":"IF(P9=\"\",\"\",\"(2)\")","v":"(2)"},null,null,{"$f":"IF(P9=\"\",\"\",入力シート!AW35)","v":0},"年",{"$f":"IF(P9=\"\",\"\",入力シート!BE35)","v":1},"月"]
[null,null,null,null,null,null,null,null,null,null,null,{"$f":"IF(AND(入力シート!P44=0,入力シート!W44=0),\"\",\"さらに除く年月数\")","v":"さらに除く年月数"},null,null,null,{"$f":"IF(L11=\"\",\"\",\"その他\")","v":"その他"},null,null,null,null,null,null,{"$f":"SUM(R8:R15)","v":1}]
[null,null,null,"教職調整額(B)",null,{"$f":"入力シート!$U$74+入力シート!$U$96","v":11500},null,null,"円",null,null,null,null,null,{"$f":"IF(P11=\"\",\"\",\"(3)\")","v":"(3)"},null,null,{"$f":"IF(P11=\"\",\"\",入力シート!P44)","v":1},"年",{"$f":"IF(P11=\"\",\"\",入力シート!W44)","v":2},"月",null,{"$f":"ROUNDDOWN((W15)/12,0)","v":0}]
[null,null,null,null,null,null,null,null,null,null,null,null,null,null,null,{"$f":"IF(L13=\"\",\"\",入力シート!#REF!)","v":""},null,null,null,null,null,null,{"$f":"MOD(W15,12)","v":7.8}]
[null,null,null,null,null,null,null,null,null,null,null,null,null,null,{"$f":"IF(P13=\"\",\"\",\"(4)\")","v":""},null,null,{"$f":"IF(P13=\"\",\"\",入力シート!#REF!)","v":""},"年",{"$f":"IF(P13=\"\",\"\",入力シート!#REF!)","v":""},"月"]
[null,null,null,"給料の調整額(C)",null,{"$f":"入力シート!AN74","v":0},null,null,"円",null,null,null,null,null,null,null,null,null,{"$f":"IF(O15=\"\",\"\",\"年\")","v":""},null,{"$f":"IF(O15=\"\",\"\",\"月\")","v":""},null,{"$f":"SUM(T8:T15)","v":7.8}]
[null,null,null,null,null,null,null,null,null,null,null,"計(ｲ)",null,null,null,null,null,{"$f":"+W11+W12","v":1},"年",{"$f":"W13","v":7.8},"月"]
[]
[null,null,null,"計(D)",null,{"$f":"F8+F12+F15","v":435300},null,null,"円",null,"合計(ｳ) =(ｱ)-(ｲ)",null,null,null,null,{"$f":"IF(W20>0,W20,0)","v":34},"年",{"$f":"IF(X20>0,X20,0)","v":4.1999999999999886},"月(",{"$f":"IF(AND(P18<=0,R18>=6),P18+1,P18)","v":34},"年)",null,{"$f":"W6-(W13+(W11+W12)*12)","v":412.2}]
[null,null,null,null,null,null,null,null,null,"(C)"]
[null,null,null,null,null,null,null,null,null,"の","定額分",null,null,"調整数",null,null,null,null,null,null,null,null,{"$f":"ROUNDDOWN(W18/12,0)","v":34},{"$f":"W18-W20*12","v":4.1999999999999886}]
{"$rows_left_out":29}
{"sheet":"支給率シート","index":3,"n_rows":15,"n_cols":13,"rows_kept":15,"cut":false,"hidden":true,"merged":[[12,3,12,14],[14,3,14,15]]}
["支給率算定シート"]
[null,null,null,null,null,null,null,null,null,null,null,null,"自己都合"]
[null,null,null,null,null,null,null,null,null,null,null,null,"定年・勧奨"]
[]
[]
[null,null,null,"※１勤続年数",null,{"$f":"入力シート!AW43","v":34},null,null,null,"支給率",{"$f":"IF(F9=1,VLOOKUP($F$6,'H30.4.1'!A5:C50,3,FALSE),VLOOKUP($F$6,'H30.4.1'!A5:C50,2,FALSE))","v":46.830150000000003}]
[]
[null,null,null,"退職区分"]
[null,null,null,{"$f":"入力シート!B13","v":"定年扱い"},null,{"$f":"IF(D9=\"自己都合\",1,2)","v":2}]
[]
[]
[]
[null,null,null,"※１）　育児休業、休職等の期間を除いた年数"]
[]
[null,null,null,"　　　　１年未満の端数は切り捨て　例）３５年６月　→３５年"]

{"sheet":"【参考】調整額区分表","index":4,"n_rows":44,"n_cols":11,"rows_kept":44,"cut":false,"hidden":false,"merged":[]}
["退職手当の調整額に関する区分表"]
[]
["イ　１９年３月３１日までの適用区分"]
["区分","第１号","第２号","第３号","第４号","第５号","第６号","第７号","第８号","第９号","第１０号"]
["調整月額",78750,70400,65000,59550,54150,43350,32500,27100,21700,0]
["行政職",null,null,"１１級\n期20%","１０級\n期20%","９級\n期15%","８級\n期15%","７級\n期10%","６級\n期10%","５級・４級\n期5%","３級・２級・１級"]
["教育職(二)",null,null,null,"４級\n期20%","４級\n管16%・管14%\n期15%","４級\n期15%","３級　期10%\n２級期10%のうち注８の者","２級\n期10%","２級・１級\n期5%","２級・１級"]
["教育職(三)",null,null,null,"４級\n期20%","４級\n管16%・管14%\n期15%","４級\n期15%","３級　期10%\n２級期10%のうち注８の者","２級\n期10%","２級\n期5%","２級・１級"]
["研究職",null,null,"５級\n管25%\n期20%","５級\n期20%","４級\n管18%\n期15%","４級 期15%\n３級のうち注４の職","３級のうち注５の職","３級\n期10%","２級\n期5%","２級・１級"]
["医療職(二)\n医療職(三)",null,null,null,null,"７級\n期15%","６級\n期15%","５級のうち注６の職","５級\n期10%","４級  期5%\n３級　期5%","3級・2級・1級"]
["技能職",null,null,null,null,null,null,null,"５級\n期10%","４級  期5%\n３級　期5%\n２級　期5%","４級・３級・\n２級・１級"]
[]
["ロ　１９年４月１日から21年３月31日までの適用区分"]
["区分","第１号","第２号","第３号","第４号","第５号","第６号","第７号","第８号","第９号","第１０号"]
["調整月額",78750,70400,65000,59550,54150,43350,32500,27100,21700,0]
["行政職",null,"１０級\n期20%","９級\n期20%","８級\n期20%","７級\n期15%","６級\n期15%","５級\n期10%","４級\n期10%","３級\n期5%","２級・１級"]
["教育職(二)",null,null,null,"４級\n期20%","４級\n管６種\n期15%","４級\n期15%","３級　期10%\n２級期10%のうち注８の者","２級\n期10%","２級・１級\n期5%","２級・１級"]
["教育職(三)",null,null,null,"４級\n期20%","４級\n管６種\n期15%","４級\n期15%","３級　期10%\n２級期10%のうち注８の者","２級\n期10%","２級\n期5%","２級・１級"]
["研究職",null,null,"５級\n管１種\n期20%","５級\n期20%","４級\n管４種\n期15%","４級 期15%\n３級のうち注４の職","３級のうち注５の職","３級\n期10%","２級\n期5%","２級・１級"]
["医療職(二)\n医療職(三)",null,null,null,null,"７級\n期15%","６級\n期15%","５級のうち注７の職","５級\n期10%","４級  期5%\n３級　期5%","3級・2級・1級"]
{"$rows_left_out":25}
{"sheet":"給料表計算シート","index":5,"n_rows":25,"n_cols":7,"rows_kept":25,"cut":false,"hidden":true,"merged":[[11,1,11,3],[20,1,20,3]]}
["１　現在の給料表"]
[]
[null,null,null,null,"給料表","調整額","給与表コード"]
["行政",{"$f":"IF(入力シート!$B$65=\"行政\",入力シート!$B$65,\"\")","v":""},{"$f":"IF(B4=\"\",\"\",入力シート!$U$65)","v":""},{"$f":"IF(B4=\"\",\"\",入力シート!$AC$65)","v":""},{"$f":"IF(B4=\"\",\"\",VLOOKUP($D$16,'R7給料表'!$B$2:$C$4252,2,0))","v":""},{"$f":"IF(B4=\"\",\"\",VLOOKUP($D$17,'R7給料表'!$F$2:$G$4252,2,0))","v":""},{"$f":"IF(B4=\"\",\"\",1)","v":""}]
["教育（一）",{"$f":"IF(入力シート!$B$65=\"教育（一）\",入力シート!$B$65,\"\")","v":""},{"$f":"IF(B5=\"\",\"\",入力シート!$U$65)","v":""},{"$f":"IF(B5=\"\",\"\",入力シート!$AC$65)","v":""},{"$f":"IF(B5=\"\",\"\",VLOOKUP($D$16,'R7給料表'!$B$2:$C$4252,2,0))","v":""},{"$f":"IF(B5=\"\",\"\",VLOOKUP($D$17,'R7給料表'!$F$2:$G$4252,2,0))","v":""},{"$f":"IF(B5=\"\",\"\",4)","v":""}]
["教育（二）",{"$f":"IF(入力シート!$B$65=\"教育（二）\",入力シート!$B$65,\"\")","v":"教育（二）"},{"$f":"IF(B6=\"\",\"\",入力シート!$U$65)","v":3},{"$f":"IF(B6=\"\",\"\",入力シート!$AC$65)","v":50},{"$f":"IF(B6=\"\",\"\",VLOOKUP($D$16,'R7給料表'!$B$2:$C$4252,2,0))","v":423800},{"$f":"IF(B6=\"\",\"\",VLOOKUP($D$17,'R7給料表'!$F$2:$G$4252,2,0))","v":12000},{"$f":"IF(B6=\"\",\"\",5)","v":5}]
["研究",{"$f":"IF(入力シート!$B$65=\"研究\",入力シート!$B$65,\"\")","v":""},{"$f":"IF(B7=\"\",\"\",入力シート!$U$65)","v":""},{"$f":"IF(B7=\"\",\"\",入力シート!$AC$65)","v":""},{"$f":"IF(B7=\"\",\"\",VLOOKUP($D$16,'R7給料表'!$B$2:$C$4252,2,0))","v":""},{"$f":"IF(B7=\"\",\"\",VLOOKUP($D$17,'R7給料表'!$F$2:$G$4252,2,0))","v":""},{"$f":"IF(B7=\"\",\"\",6)","v":""}]
["技能",{"$f":"IF(入力シート!$B$65=\"技能\",入力シート!$B$65,\"\")","v":""},{"$f":"IF(B8=\"\",\"\",入力シート!$U$65)","v":""},{"$f":"IF(B8=\"\",\"\",入力シート!$AC$65)","v":""},{"$f":"IF(B8=\"\",\"\",VLOOKUP($D$16,'R7給料表'!$B$2:$C$4252,2,0))","v":""},{"$f":"IF(B8=\"\",\"\",VLOOKUP($D$17,'R7給料表'!$F$2:$G$4252,2,0))","v":""},{"$f":"IF(B8=\"\",\"\",10)","v":""}]
["医療（二）",{"$f":"IF(入力シート!$B$65=\"医療（二）\",入力シート!$B$65,\"\")","v":""},{"$f":"IF(B9=\"\",\"\",入力シート!$U$65)","v":""},{"$f":"IF(B9=\"\",\"\",入力シート!$AC$65)","v":""},{"$f":"IF(B9=\"\",\"\",VLOOKUP($D$16,'R7給料表'!$B$2:$C$4252,2,0))","v":""},{"$f":"IF(B9=\"\",\"\",VLOOKUP($D$17,'R7給料表'!$F$2:$G$4252,2,0))","v":""},{"$f":"IF(B9=\"\",\"\",8)","v":""}]
["医療（三）",{"$f":"IF(入力シート!$B$65=\"医療（三）\",入力シート!$B$65,\"\")","v":""},{"$f":"IF(B10=\"\",\"\",入力シート!$U$65)","v":""},{"$f":"IF(B10=\"\",\"\",入力シート!$AC$65)","v":""},{"$f":"IF(B10=\"\",\"\",VLOOKUP($D$16,'R7給料表'!$B$2:$C$4252,2,0))","v":""},{"$f":"IF(B10=\"\",\"\",VLOOKUP($D$17,'R7給料表'!$F$2:$G$4252,2,0))","v":""},{"$f":"IF(B10=\"\",\"\",9)","v":""}]
[]
[null,"給料月額",null,null,{"$f":"MAX(E4:E10)","v":423800},{"$f":"MAX(F4:F10)","v":12000}]
[null,"給与表コード","級","号俸"]
[null,{"$f":"SUM(G4:G10)","v":5},{"$f":"SUM(C4:C10)","v":3},{"$f":"SUM(D4:D10)","v":50}]
[]
["給料表",{"$f":"TEXT(B14,\"0\")&TEXT(C14,\"00\")&TEXT(D14,\"000\")","v":"503050"},null,{"$f":"B16*1","v":503050}]
["調整額",{"$f":"TEXT(B14,\"0\")&TEXT(C14,\"00\")","v":"503"},null,{"$f":"B17*1","v":503}]
[null,null,null,null,"給料表","調整額","給料表コード"]
["技能 H27",{"$f":"IF(OR(入力シート!U70=\"\",入力シート!AC70=\"\"),\"\",\"技能\")","v":""},{"$f":"IF(B19=\"\",\"\",入力シート!$U$70)","v":""},{"$f":"IF(B19=\"\",\"\",入力シート!$AC$70)","v":""},{"$f":"IF(B19=\"\",\"\",VLOOKUP($D$25,'R7給料表'!B:D,3,0))","v":""},null,{"$f":"IF(B19=\"\",\"\",10)","v":""}]
[]
{"$rows_left_out":6}
{"sheet":"R7給料表","index":6,"n_rows":4252,"n_cols":8,"rows_kept":4252,"cut":false,"hidden":true,"merged":[]}
["2025-04-01","表級号","金額",null,"調整額","表級","金額"]
[null,101001,197400,null,"基本額表",101,6700]
[null,101002,198500,null,null,102,8600]
[null,101003,199700,null,null,103,9800]
[null,101004,200800,null,null,104,10500]
[null,101005,201900,null,null,105,10800]
[null,101006,203600,null,null,106,11400]
[null,101007,205300,null,null,107,12300]
[null,101008,206900,null,null,108,13000]
[null,101009,208400,null,null,109,14700]
[null,101010,210100,null,null,110,16300,"行政職"]
[null,101011,211700,null,null,401,9100]
[null,101012,213300,null,null,402,11300]
[null,101013,214800,null,null,425,11700]
[null,101014,216600,null,null,403,12400]
[null,101015,218300,null,null,404,13300,"教育職（１）"]
[null,101016,220000,null,null,501,8600]
[null,101017,221100,null,null,502,11100]
[null,101018,222700,null,null,525,11400]
[null,101019,224300,null,null,503,12000]
{"$rows_left_out":4233}
{"sheet":"（除算）","index":7,"n_rows":8,"n_cols":4,"rows_kept":8,"cut":false,"hidden":true,"merged":[[5,1,6,2],[5,3,6,11],[7,1,9,2],[7,3,9,11],[1,3,4,11],[1,1,4,2]]}
[]
[null,"〇休職\n〇停職\n〇大学院修学休業\n〇育児休業",null,"　月の初日から末日まで勤務しない月が１月以上あったときは、その月数の２分の１\n　　（例）休職期間　平成２５年２月１４日～平成２６年２月１３日の場合\n　　　平成２５年３月　～　平成２６年１月までの　１１月×１/２＝５．５月が除算となる\n　※ただし、育児休業の場合は、当該育児休業に係る子が１歳に達した日の属する月まで\n　の期間については、その月数の３分の１"]
[]
[]
[]
[null,"〇高齢者部分休業の期間",null,"　７時間４５分をもって１日とし、３０日をもって１月として換算した月数の２分の１"]
[]
[null,"〇組合専従の期間\n〇自己啓発等休業\n〇配偶者同行休業",null,"　月の初日から末日まで勤務しない月が１月以上あったときは、その月数の全部の月数\n　※ただし、自己啓発等休業のうち、公務運営に特に資するものと認められること等要件に\n　該当する場合は、その月数の２分の１"]

{"sheet":"（計算方法）","index":8,"n_rows":13,"n_cols":13,"rows_kept":13,"cut":false,"hidden":true,"merged":[[5,1,5,3],[5,5,5,7],[5,9,5,10],[5,12,5,13],[8,4,8,13],[12,4,12,13],[6,11,6,13],[10,1,10,2],[12,1,12,2],[8,1,8,2],[10,4,10,13]]}
[]
[]
[]
[]
[]
["※","退職手当の給料月額",null,null,"＝","本俸（給料表の月額）",null,null,"＋","教職調整額",null,"＋","給料の調整額"]
[null,null,null,null,null,null,null,null,null,null,null,"（福利厚生ハンドブック　26貢参照）"]
[]
[null,"本俸",null,"・・・・・","給料表上の月額です。"]
[]
[null,"教職調整額",null,"・・・・・","校長（県立） ３，８００円 （小中） ４，０００円 ／ 副校長・教頭 １１，５００円 ／教諭　給料表上の月額×５％ （R8.4.1現在）"]
[]
[null,"給料の調整額",null,"・・・・・","特別支援学校（学級）に従事する教員が該当します。調整基本額×１．００ （R8.4.1現在）"]

{"sheet":"H30.4.1","index":9,"n_rows":50,"n_cols":8,"rows_kept":50,"cut":false,"hidden":true,"merged":[]}
[null,null,null,null,null,"新支給率"]
[null,null,null,"新"]
[null,"勧奨","自己都合",null,null,null,"1985-03-31",{"$f":"DATEVALUE(G3)","v":{"$error":"#VALUE!"}}]
[" 年  数"]
[0,null,0]
[1,0.83700000000000008,0.50219999999999998]
[2,1.6740000000000002,1.0044]
[3,2.5110000000000001,1.5065999999999999]
[4,3.3480000000000003,2.0087999999999999]
[5,4.1849999999999996,2.5110000000000001]
[6,5.0220000000000002,3.0131999999999999]
[7,5.859,3.5154000000000001]
[8,6.6960000000000006,4.0175999999999998]
[9,7.5330000000000004,4.5198]
[10,8.3699999999999992,5.0220000000000002]
[11,11.613375000000001,7.4325600000000005]
[12,12.764249999999999,8.1691199999999977]
[13,13.915125,8.9056800000000003]
[14,15.066000000000001,9.642240000000001]
[15,16.216875000000002,10.378800000000002]
{"$rows_left_out":30}