{"text_format":"1","workbook":"xlsx","n_sheets":16,"sheets":["試算シートの使い方","入力シート","Sheet1","印刷シート","【参考】調整額区分表","特に級読替表","H193.31勤続期間","給料表","給料表計算シート","計算シート","Sheet2","除算","加算率","H30.4.1","H19.3.31（H2７.3.31）","育休特殊事例入力方法"],"not_rendered":{"charts":0,"images":11,"macros":1,"external_links":1,"defined_names":23,"comments":4,"pivot_tables":0},"unopened":[],"bounds":{"document_bytes":16777216,"sheet_cells":100000,"rows_first":2000,"rows_last":500,"rows_between":2000,"halvings":0,"cell_chars":16384,"cell_head_chars":4096},"cells_cut":0,"cells_raw":0,"read":"whole","date_system":"1900"}

{"sheet":"試算シートの使い方","index":0,"n_rows":85,"n_cols":8,"rows_kept":85,"cut":false,"hidden":false,"merged":[[0,0,0,8],[3,1,3,5],[4,1,4,5],[6,1,6,5],[9,1,9,8],[5,1,5,8],[1,7,1,8],[64,1,64,8],[65,1,65,8],[62,0,62,8],[82,1,82,2],[10,1,10,8]]}
["詳細版退職手当試算シートの使用について"]
[null,null,null,null,null,null,null,"R5.8.7　現在"]
["１　用意するもの（全てが揃わなくても試算は可能です）"]
["（１）"," 履歴書　…　除算期間・前歴等確認用"]
["（２）"," 給与個人票（最新）　…　給料号俸等確認用"]
["（３）"," 期末勤勉手当加算率リスト（過去５年分）　…　加算率確認用"]
["（４）"," ２０２３年保存版　福利厚生ハンドブック　　　　　　　　　　　　　"]
[]
{"$rows_left_out":78}
{"sheet":"入力シート","index":1,"n_rows":167,"n_cols":74,"rows_kept":167,"cut":false,"hidden":false,"merged":[[123,1,124,4],[125,17,126,20],[123,5,124,8],[123,9,124,10],[123,11,124,14],[123,15,124,16],[123,17,124,20],[121,17,122,22],[116,13,116,64],[116,1,116,12],[121,1,122,4],[121,5,122,10],[121,23,122,28],[121,29,122,34],[121,11,122,16],[119,23,120,28],[119,11,120,16],[119,17,120,22],[123,21,124,22],[123,47,124,50],[123,51,124,52],[125,27,126,28],[125,23,126,26],[125,41,126,44],[125,47,126,50],[125,45,126,46],[125,21,126,22],[123,23,124,26],[123,27,124,28],[123,29,124,32],[123,33,124,34],[123,35,124,38],[123,39,124,40],[123,41,124,44],[123,45,124,46],[125,39,126,40],[125,29,126,32],[129,57,130,58],[123,57,124,58],[136,57,136,58],[136,63,136,64],[35,5,35,14],[45,5,45,14],[55,5,55,14],[65,5,65,14],[136,29,136,32],[136,33,136,34],[135,5,135,8],[123,59,124,62],[123,63,124,64],[135,35,135,38],[135,51,135,52],[135,53,135,56],[135,17,135,20],[125,33,126,34],[125,35,126,38],[135,47,135,50],[125,63,126,64],[80,20,81,21],[135,29,135,32],[123,53,124,56],[127,35,127,44],[131,41,132,44],[129,35,130,38],[133,1,133,34],[129,23,130,26],[129,27,130,28],[128,65,128,67],[135,9,135,10],[135,15,135,16],[135,33,135,34],[128,53,128,56],[128,59,128,62],[131,47,132,50],[131,51,132,52],[135,45,135,46],[131,35,132,38],[135,63,135,64],[135,59,135,62],[129,33,130,34],[127,51,127,62],[131,29,132,32],[131,33,132,34],[128,35,128,38],[128,41,128,44],[175,11,175,49],[176,11,176,49],[178,11,178,49],[175,50,175,53],[177,11,177,49],[172,39,172,42],[172,43,172,46],[172,27,172,30],[171,3,171,10],[171,27,171,30],[172,23,172,26],[172,3,172,10],[171,15,171,18],[171,19,171,22],[171,23,171,26],[171,31,171,34],[171,35,171,38],[175,3,176,10],[177,3,177,10],[178,3,178,10],[176,50,176,53],[178,50,178,53],[177,50,177,53],[187,3,187,10],[185,43,185,50],[186,43,186,50],[179,11,179,49],[180,11,180,49],[185,11,185,18],[185,19,185,26],[185,35,185,42],[186,11,186,18],[186,19,186,26],[187,11,187,53],[186,27,186,34],[186,35,186,42],[179,3,183,10],[179,50,179,53],[181,11,181,49],[183,50,183,53],[182,50,182,53],[180,50,181,53],[182,11,182,49],[185,27,185,34],[184,3,184,53],[183,11,183,49],[129,41,130,44],[129,45,130,46],[129,47,130,50],[174,50,174,53],[129,21,130,22],[129,11,130,14],[129,15,130,16],[136,23,136,26],[136,27,136,28],[137,1,137,34],[172,35,172,38],[174,11,174,49],[172,31,172,34],[172,15,172,18],[172,19,172,22],[137,51,137,62],[135,39,135,40],[135,27,135,28],[136,35,136,38],[137,35,137,44],[171,43,171,46],[129,39,130,40],[129,29,130,32],[174,3,174,10],[131,59,132,62],[131,1,132,4],[131,5,132,8],[131,9,132,10],[131,11,132,14],[131,15,132,16],[131,17,132,20],[136,1,136,4],[172,11,172,14],[136,5,136,8],[136,9,136,10],[136,11,136,14],[135,11,135,14],[136,15,136,16],[136,17,136,20],[136,21,136,22],[135,23,135,26],[135,21,135,22],[135,1,135,4],[131,27,132,28],[169,1,169,3],[169,4,169,61],[171,11,171,14],[125,53,126,56],[121,59,122,64],[121,41,122,46],[121,47,122,52],[121,53,122,58],[133,35,133,44],[129,51,130,52],[137,45,137,50],[135,41,135,44],[136,59,136,62],[136,53,136,56],[136,41,136,44],[136,45,136,46],[136,39,136,40],[135,57,135,58],[129,59,130,62],[134,1,134,64],[131,63,132,64],[131,45,132,46],[129,53,130,56],[129,63,130,64],[131,21,132,22],[131,23,132,26],[133,45,133,50],[52,1,53,4],[52,5,53,14],[52,15,53,28],[44,15,44,28],[25,49,26,52],[36,5,36,14],[37,5,37,14],[36,29,36,42],[171,39,171,42],[136,47,136,50],[136,51,136,52],[133,51,133,62],[131,39,132,40],[131,53,132,56],[131,57,132,58],[119,41,120,46],[127,45,127,50],[125,59,126,62],[125,51,126,52],[125,57,126,58],[119,35,120,40],[121,35,122,40],[119,53,120,58],[119,47,120,52],[84,1,84,64],[119,59,120,64],[119,29,120,34],[80,22,81,26],[80,27,81,28],[112,1,112,12],[114,1,114,12],[118,1,118,64],[119,1,120,4],[92,33,93,36],[119,5,120,10],[96,39,96,55],[112,13,112,62],[114,13,114,65],[110,47,110,48],[110,49,110,62],[100,20,100,36],[97,33,98,36],[97,17,97,19],[96,1,98,16],[96,20,96,36],[108,1,108,62],[110,15,110,16],[91,1,91,17],[5,1,5,57],[8,1,9,13],[7,1,7,13],[7,17,7,33],[1,39,1,47],[16,1,17,13],[13,1,14,13],[15,1,15,58],[1,52,1,63],[3,1,3,63],[16,16,17,42],[12,1,12,64],[13,16,13,53],[14,16,14,64],[8,17,9,33],[42,1,43,4],[42,5,43,14],[42,15,43,28],[42,29,43,42],[42,43,43,46],[42,61,43,64],[45,15,45,25],[45,26,45,28],[25,15,26,28],[25,1,26,14],[32,1,33,4],[32,5,33,14],[32,15,33,28],[31,29,31,64],[25,61,26,64],[32,61,33,64],[32,29,33,42],[32,43,33,46],[32,47,33,60],[25,57,26,60],[34,15,34,28],[29,1,29,64],[30,1,30,64],[46,26,46,28],[35,61,35,64],[41,5,41,14],[41,15,41,28],[41,29,41,64],[38,43,39,46],[38,55,39,64],[36,61,36,64],[35,29,35,42],[35,47,35,60],[38,47,39,50],[38,33,39,42],[35,15,35,25],[20,1,21,13],[20,14,21,17],[20,20,21,36],[27,1,28,14],[27,15,28,28],[25,35,26,48],[45,65,45,68],[45,69,45,72],[35,73,36,75],[36,65,36,68],[35,65,35,68],[35,69,35,72],[36,69,36,72],[45,73,46,75],[46,29,46,42],[46,47,46,60],[46,61,46,64],[46,65,46,68],[46,69,46,72],[36,47,36,60],[36,26,36,28],[35,26,35,28],[38,51,39,54],[25,53,26,56],[55,65,55,68],[55,69,55,72],[55,73,56,75],[45,29,45,42],[56,26,56,28],[56,29,56,42],[56,47,56,60],[56,61,56,64],[56,65,56,68],[56,69,56,72],[55,26,55,28],[55,29,55,42],[55,47,55,60],[55,61,55,64],[45,47,45,60],[54,15,54,28],[55,15,55,25],[45,61,45,64],[52,29,53,42],[52,43,53,46],[52,47,53,60],[48,33,49,42],[48,43,49,46],[48,47,49,50],[62,1,63,4],[62,5,63,14],[62,15,63,28],[62,29,63,42],[62,43,63,46],[62,47,63,60],[58,51,59,54],[58,55,59,64],[61,5,61,14],[61,15,61,28],[61,29,61,64],[58,43,59,46],[65,73,66,75],[68,69,69,69],[68,70,69,72],[68,73,69,73],[67,69,67,73],[78,66,78,73],[66,65,66,68],[66,69,66,72],[65,65,65,68],[68,66,69,68],[128,47,128,50],[100,1,100,17],[101,1,102,13],[65,47,65,60],[25,67,26,71],[25,65,26,66],[80,66,80,72],[65,69,65,72],[68,33,69,42],[68,43,69,46],[68,47,69,50],[58,47,59,50],[79,61,80,64],[79,31,80,47],[83,1,83,64],[79,5,79,14],[79,15,79,28],[80,5,81,14],[110,17,110,30],[110,1,110,14],[79,48,80,60],[91,20,91,36],[68,51,69,54],[68,55,69,64],[129,17,130,20],[129,1,130,4],[129,5,130,8],[129,9,130,10],[128,29,128,32],[125,5,126,8],[125,9,126,10],[125,11,126,14],[125,15,126,16],[128,23,128,26],[127,1,127,34],[125,1,126,4],[66,26,66,28],[66,47,66,60],[66,61,66,64],[58,33,59,42],[64,15,64,28],[65,61,65,64],[80,15,81,19],[71,5,77,50],[48,51,49,54],[48,55,49,64],[51,5,51,14],[51,15,51,28],[51,29,51,64],[52,61,53,64],[65,29,65,42],[66,29,66,42],[101,14,102,17],[101,33,102,36],[101,39,102,51],[101,52,102,55],[97,39,98,51],[97,52,98,55],[92,20,93,24],[92,25,93,27],[92,28,93,32],[92,52,93,55],[111,1,111,63],[31,5,31,14],[62,61,63,64],[65,15,65,25],[65,26,65,28],[79,1,81,4],[95,20,95,36],[31,15,31,28],[101,58,102,64],[36,15,36,25],[42,47,43,60],[101,20,102,32],[106,1,106,62],[104,1,104,62],[110,33,110,46],[110,31,110,32],[100,39,100,55],[92,1,93,17],[91,39,91,55],[92,39,93,51],[97,20,98,24],[97,25,98,27],[97,28,98,32],[95,39,95,55]]}
[null,"詳細版"]
[null,"退職手当試算入力シート",null,null,null,null,null,null,null,null,null,null,null,null,null,null,null,null,null,null,null,null,null,null,null,null,null,null,null,null,null,null,null,null,null,null,null,null,null,"入力箇所(必須）",null,null,null,null,null,null,null,null,null,null,null,null,"入力箇所（場合によって）"]
[]
[null,"退職時のおおよその退職手当額を試算します。\n黄色いセル，（場合によっては）青いセルに入力してください。"]
[]
[1,"試算希望者の氏名と，退職（予定）日時点の年齢を入力してください。"]
[]
[null,"氏　　名",null,null,null,null,null,null,null,null,null,null,null,null,null,null,null,"生年月日"]
{"$rows_left_out":160}
{"sheet":"Sheet1","index":2,"n_rows":17,"n_cols":2,"rows_kept":17,"cut":false,"hidden":true,"merged":[[8,1,8,9]]}
[]
[null,"行政職給料表が適用されている者"]
[null,"　退職時前５年間の号俸を確認してください。"]
[null,"　例１）退職時前５年間　２級　である。"]
[null,"　　　　第10号区分に　６０月　と入力します。"]
[null,"　例２）退職時より３年前に４級に昇給し、それ以前は３級であった。"]
[null,"　　　　第9号区分に　２４月（２年間）、第8号区分に　３６月（３年間）と入力します。"]
[]
{"$rows_left_out":10}
{"sheet":"印刷シート","index":3,"n_rows":46,"n_cols":35,"rows_kept":46,"cut":false,"hidden":false,"merged":[[1,19,1,20],[1,14,1,18],[3,10,5,10],[6,10,16,10],[6,15,7,16],[2,14,2,18],[1,9,1,10],[2,9,2,10],[15,18,16,18],[15,19,16,19],[15,20,16,20],[8,15,9,16],[10,15,11,16],[12,15,13,16],[15,11,16,16],[14,11,14,13],[15,17,16,17],[36,5,36,7],[37,5,37,7],[38,5,38,7],[32,5,32,7],[33,5,33,7],[34,5,34,7],[35,5,35,7],[26,13,26,15],[17,5,18,7],[17,8,18,8],[20,13,20,14],[27,9,27,10],[20,5,20,7],[38,2,38,4],[39,2,39,4],[41,5,41,7],[42,5,42,7],[43,5,43,7],[39,5,39,7],[40,5,40,7],[1,1,2,8],[29,1,30,4],[31,1,31,4],[29,5,31,7],[14,5,16,7],[14,8,16,8],[10,5,10,7],[29,8,31,8],[8,5,8,7],[11,5,11,7],[14,3,16,4],[7,5,7,7],[17,3,18,4]]}
[]
[null,"退職手当計算内訳書　（試算）",null,null,null,null,null,null,null,"氏名：",null,{"$f":"IF(入力シート!B9=\"\",\"\",入力シート!B9)","v":"福　梨花"},null,null,{"$f":"TODAY()","v":"2023-08-07"},null,null,null,null,"現在",null,null,null,null,null,null,null,{"$f":"IF(入力シート!B14=\"自己都合\",\"自己都合\",IF(入力シート!B14=\"定年\",\"定年\"))","v":"定年"}]
[null,null,null,null,null,null,null,null,null,"事由：",null,{"$f":"$AB$2&\"退職\"","v":"定年退職"}]
[null,"退","給",null,null,null,null,null,null,"勤","在職年数",{"$f":"入力シート!P26","v":"1989-04-01"},null,null,null,"から"]
[null,"職","料","級号俸",null,{"$f":"IF(入力シート!U93=\"\",\"\",IF(F8=入力シート!AN98,入力シート!U98,入力シート!U93))","v":2},"級",{"$f":"IF(入力シート!AC93=\"\",\"\",IF(F8=入力シート!AN98,入力シート!AC98,入力シート!AC93))","v":140},"号俸","続",null,{"$f":"入力シート!P28","v":"2024-03-31"},null,null,null,"まで",null,{"$f":"入力シート!$AX$26","v":35},"年",{"$f":"入力シート!$BF$26","v":0},"月"]
[null,"時","月",null,null,null,null,null,null,"年",null,"計(ｱ)",null,null,null,null,null,{"$f":"R5","v":35},"年",{"$f":"T5","v":0},"月",null,{"$f":"R6*12+T6","v":420}]
[null,"の","額",null,null,null,null,null,null,"数","除算年数",{"$f":"IF(AND(入力シート!AR39=0,入力シート!AZ39=0),\"\",入力シート!AD36)","v":"1993-03-01"},"から",null,null,{"$f":"IF(L7=\"\",\"\",入力シート!F33)","v":"育休"}]
[null,"給",null,"給料(A)",null,{"$f":"入力シート!$B$102","v":417900},null,null,"円",null,null,{"$f":"IF(AND(入力シート!AR39=0,入力シート!AZ39=0),\"\",入力シート!AV37)","v":"1993-12-31"},"まで",null,{"$f":"IF(P7=\"\",\"\",\"(1)\")","v":"(1)"},null,null,{"$f":"IF(P7=\"\",\"\",入力シート!AR39)","v":0},"年",{"$f":"IF(P7=\"\",\"\",入力シート!AZ39)","v":3.3},"月"]
{"$rows_left_out":39}
{"sheet":"【参考】調整額区分表","index":4,"n_rows":44,"n_cols":11,"rows_kept":44,"cut":false,"hidden":false,"merged":[]}
["退職手当の調整額に関する区分表"]
[]
["イ　１９年３月３１日までの適用区分"]
["区分","第１号","第２号","第３号","第４号","第５号","第６号","第７号","第８号","第９号","第１０号"]
["調整月額",78750,70400,65000,59550,54150,43350,32500,27100,21700,0]
["行政職",null,null,"１１級\n期20%","１０級\n期20%","９級\n期15%","８級\n期15%","７級\n期10%","６級\n期10%","５級・４級\n期5%","３級・２級・１級"]
["教育職(二)",null,null,null,"４級\n期20%","４級\n管16%・管14%\n期15%","４級\n期15%","３級　期10%\n２級期10%のうち注８の者","２級\n期10%","２級・１級\n期5%","２級・１級"]
["教育職(三)",null,null,null,"４級\n期20%","４級\n管16%・管14%\n期15%","４級\n期15%","３級　期10%\n２級期10%のうち注８の者","２級\n期10%","２級\n期5%","２級・１級"]
{"$rows_left_out":37}
{"sheet":"特に級読替表","index":5,"n_rows":67,"n_cols":21,"rows_kept":67,"cut":false,"hidden":false,"merged":[[11,23,11,24],[3,15,4,16],[3,17,4,18],[3,19,4,20],[3,21,4,22],[3,23,4,24],[7,21,7,22],[7,23,7,24],[8,23,8,24],[10,23,10,24],[8,21,8,22],[9,21,9,22],[9,23,9,24],[10,21,10,22],[11,21,11,22],[3,1,4,1],[7,1,7,2],[8,1,8,2],[36,1,36,2],[48,1,48,2],[63,1,63,2],[5,3,5,20],[17,17,18,18],[17,19,18,20],[9,1,9,2],[10,1,10,2],[28,1,28,16],[38,18,38,20],[60,14,60,20],[19,3,19,10],[38,1,38,2],[44,11,45,12],[17,1,18,1],[17,3,18,4],[17,5,18,6],[17,7,18,8],[17,15,18,16],[44,3,45,4],[44,5,45,6],[66,1,66,2],[30,1,31,1],[30,3,31,4],[30,5,31,6],[65,1,65,2],[64,1,64,2],[46,1,47,2],[49,1,49,2],[41,1,41,12],[62,1,62,2],[60,3,60,12],[60,1,61,2],[44,9,45,10],[44,7,45,8],[51,1,51,2],[55,1,55,12],[58,9,59,10],[52,1,52,2],[58,11,59,12],[58,1,59,1],[58,3,59,4],[58,5,59,6],[58,7,59,8],[44,1,45,1],[50,1,50,2],[14,1,14,10],[37,1,37,2],[21,1,21,2],[22,1,22,2],[23,1,23,2],[24,1,24,2],[30,7,31,8],[30,9,31,10],[17,9,18,10],[0,1,0,20],[14,13,14,20],[35,18,35,20],[36,18,36,20],[37,18,37,20],[34,1,34,2],[30,11,31,12],[30,13,31,14],[28,18,28,20],[17,13,18,14],[19,13,19,20],[5,1,6,2],[3,9,4,10],[3,11,4,12],[11,1,11,2],[3,13,4,14],[3,3,4,4],[3,5,4,6],[3,7,4,8],[35,1,35,2],[19,1,20,2],[32,1,33,2],[25,1,25,2],[30,18,30,20],[62,14,62,20],[63,14,63,20],[64,14,64,20],[65,14,65,20],[41,13,41,21],[31,18,31,20],[32,18,32,20],[33,18,33,20],[34,18,34,20],[30,15,31,16],[61,14,61,20],[48,14,48,20]]}
[null,"行　政　職　給　料　表"]
[]
[]
[null,null,"職務","１　級",null," ２　級",null,"３　級",null,"４　級",null,"５　級",null,"６　級",null,"７　級",null,"８　級",null,"９　級"]
[null,null,"の級"]
[null,"特　に",null,"読　替　号　俸"]
[null,null,null,null,"号俸",null,"号俸",null,"号俸",null,"号俸",null,"号俸",null,"号俸",null,"号俸",null,"号俸",null,"号俸"]
[null,"特(1)",null,189000,17,245400,20,317400,33,364700,29,382200,27,417900,25,428400,23,452300,22,488400,19]
{"$rows_left_out":60}
{"sheet":"H193.31勤続期間","index":6,"n_rows":47,"n_cols":74,"rows_kept":47,"cut":false,"hidden":true,"merged":[[2,61,3,64],[2,65,3,66],[2,67,3,71],[3,35,3,48],[5,5,5,14],[5,15,5,28],[5,29,5,64],[2,1,3,14],[2,15,3,28],[2,35,2,48],[2,49,3,52],[2,53,3,56],[2,57,3,60],[6,1,7,4],[6,5,7,14],[6,15,7,28],[6,29,7,42],[6,43,7,46],[6,47,7,60],[9,69,9,72],[9,73,10,75],[10,26,10,28],[10,29,10,42],[10,47,10,60],[10,61,10,64],[10,65,10,68],[10,69,10,72],[6,61,7,64],[8,15,8,28],[9,15,9,25],[9,26,9,28],[9,29,9,42],[9,47,9,60],[9,61,9,64],[12,33,13,42],[12,43,13,46],[12,47,13,50],[12,51,13,54],[12,55,13,64],[15,5,15,14],[15,15,15,28],[15,29,15,64],[9,65,9,68],[9,5,9,14],[16,61,17,64],[18,15,18,28],[19,5,19,14],[19,15,19,25],[19,26,19,28],[19,29,19,42],[19,47,19,60],[19,61,19,64],[16,1,17,4],[16,5,17,14],[16,15,17,28],[16,29,17,42],[16,43,17,46],[16,47,17,60],[19,65,19,68],[19,69,19,72],[19,73,20,75],[20,26,20,28],[20,29,20,42],[20,47,20,60],[20,61,20,64],[20,65,20,68],[20,69,20,72],[26,1,27,4],[26,5,27,14],[26,15,27,28],[26,29,27,42],[26,43,27,46],[26,47,27,60],[22,33,23,42],[22,43,23,46],[22,47,23,50],[22,51,23,54],[22,55,23,64],[25,5,25,14],[25,15,25,28],[25,29,25,64],[29,69,29,72],[29,73,30,75],[30,26,30,28],[30,29,30,42],[30,47,30,60],[30,61,30,64],[30,65,30,68],[30,69,30,72],[26,61,27,64],[28,15,28,28],[29,15,29,25],[29,26,29,28],[29,29,29,42],[29,47,29,60],[29,61,29,64],[32,33,33,42],[32,43,33,46],[32,47,33,50],[32,51,33,54],[32,55,33,64],[35,5,35,14],[35,15,35,28],[35,29,35,64],[29,65,29,68],[29,5,29,14],[45,1,46,13],[45,14,46,17],[45,31,46,47],[45,48,46,60],[45,61,46,64],[46,66,46,72],[39,73,40,75],[36,61,37,64],[38,15,38,28],[39,5,39,14],[39,15,39,25],[39,26,39,28],[39,29,39,42],[39,47,39,60],[39,61,39,64],[36,1,37,4],[36,5,37,14],[36,15,37,28],[36,29,37,42],[36,43,37,46],[36,47,37,60],[40,26,40,28],[40,29,40,42],[40,47,40,60],[40,61,40,64],[40,65,40,68],[40,69,40,72],[39,65,39,68],[39,69,39,72],[44,66,44,73],[41,69,41,73],[42,33,43,42],[42,43,43,46],[42,47,43,50],[42,51,43,54],[42,55,43,64],[42,66,43,68],[42,69,43,69],[42,70,43,72],[42,73,43,73]]}
[]
[]
[null,"採用年月日",null,null,null,null,null,null,null,null,null,null,null,null,null,{"$f":"IF(入力シート!P26=\"\",\"\",入力シート!P26)","v":"1989-04-01"},null,null,null,null,null,null,null,null,null,null,null,null,null,null,null,null,null,null,null,"2007-03-31",null,null,null,null,null,null,null,null,null,null,null,null,null,{"$f":"IFERROR(ROUNDDOWN(BP3/12,0),\"\")","v":18},null,null,null,"年",null,null,null,{"$f":"IFERROR(MOD(BP3,12),\"\")","v":0},null,null,null,"月",null,null,null,"a",null,{"$f":"IFERROR(DATEDIF(P3,AJ3,\"M\")+1,\"\")","v":216}]
[null,null,null,null,null,null,null,null,null,null,null,null,null,null,null,null,null,null,null,null,null,null,null,null,null,null,null,null,null,null,null,null,null,null,null,"までの勤続期間"]
[]
[null,null,null,null,null,"事由",null,null,null,null,null,null,null,null,null,"子の誕生日",null,null,null,null,null,null,null,null,null,null,null,null,null,"期間"]
[null,1,null,null,null,{"$f":"IF(入力シート!F33=\"\",\"\",入力シート!F33)","v":"育休"},null,null,null,null,null,null,null,null,null,{"$f":"IF(入力シート!P33=\"\",\"\",入力シート!P33)","v":"1992-12-25"},null,null,null,null,null,null,null,null,null,null,null,null,null,{"$f":"IF(入力シート!AD33>=$AJ$3,\"\",入力シート!AD33)","v":"1993-02-19"},null,null,null,null,null,null,null,null,null,null,null,null,null,"から",null,null,null,{"$f":"IF(入力シート!AV33<='H193.31勤続期間'!$AJ$3,入力シート!AV33,IF(AND(入力シート!AV33>'H193.31勤続期間'!$AJ$3,'H193.31勤続期間'!AD7>1),'H193.31勤続期間'!$AJ$3,\"\"))","v":"1993-12-31"},null,null,null,null,null,null,null,null,null,null,null,null,null,"まで"]
[]
{"$rows_left_out":40}
{"sheet":"給料表","index":7,"n_rows":3550,"n_cols":9,"rows_kept":3550,"cut":false,"hidden":true,"merged":[]}
["2022-04-01","表級号","金額",null,"2007-03-31","表級号","金額","加算額","給料月額"]
["給料表",101001,150800,null,"給料表",101002,133700,null,133700]
[null,101002,151900,null,null,101003,138100,null,138100]
[null,101003,153100,null,null,101004,142500,null,142500]
[null,101004,154200,null,null,101005,147700,null,147700]
[null,101005,155300,null,null,101006,153500,null,153500]
[null,101006,156500,null,null,101007,159400,null,159400]
[null,101007,157600,null,null,101008,165700,null,165700]
{"$rows_left_out":3543}
{"sheet":"給料表計算シート","index":8,"n_rows":25,"n_cols":15,"rows_kept":25,"cut":false,"hidden":true,"merged":[[11,2,11,3],[11,10,11,11],[20,2,20,3]]}
["１　現在の給料表",null,null,null,null,null,null,null,"２　H19の給料表"]
[]
[null,null,null,null,"給料表","調整額",null,null,null,null,null,null,"給料表","調整額"]
["行政",{"$f":"IF(入力シート!$B$93=\"行政\",入力シート!$B$93,\"\")","v":""},{"$f":"IF(B4=\"\",\"\",入力シート!$U$93)","v":""},{"$f":"IF(B4=\"\",\"\",入力シート!$AC$93)","v":""},{"$f":"IF(B4=\"\",\"\",VLOOKUP($D$16,給料表!$B$2:$C$3550,2,0))","v":""},null,{"$f":"IF(B4=\"\",\"\",1)","v":""},null,"行政",{"$f":"IF(入力シート!#REF!=\"行政\",入力シート!#REF!,\"\")","v":{"$error":"#REF!"}},{"$f":"IF(J4=\"\",\"\",入力シート!#REF!)","v":{"$error":"#REF!"}},{"$f":"IF(J4=\"\",\"\",入力シート!#REF!)","v":{"$error":"#REF!"}},{"$f":"IF(O4=\"\",\"\",VLOOKUP($L$17,給料表!$F$2:$I$1134,4,0))","v":{"$error":"#REF!"}},null,{"$f":"IF(J4=\"\",\"\",1)","v":{"$error":"#REF!"}}]
["教育（一）",{"$f":"IF(入力シート!$B$93=\"教育（一）\",入力シート!$B$93,\"\")","v":"教育（一）"},{"$f":"IF(B5=\"\",\"\",入力シート!$U$93)","v":2},{"$f":"IF(B5=\"\",\"\",入力シート!$AC$93)","v":140},{"$f":"IF(B5=\"\",\"\",VLOOKUP($D$16,給料表!$B$2:$C$3550,2,0))","v":417900},{"$f":"IF(C5=3,7700,IF(OR(C5=1,C5=2,C5=25),INT(E5/25),\"\"))","v":16716},{"$f":"IF(B5=\"\",\"\",4)","v":4},null,"教育（二）",{"$f":"IF(入力シート!#REF!=\"教育（二）\",入力シート!#REF!,\"\")","v":{"$error":"#REF!"}},{"$f":"IF(J5=\"\",\"\",入力シート!#REF!)","v":{"$error":"#REF!"}},{"$f":"IF(J5=\"\",\"\",入力シート!#REF!)","v":{"$error":"#REF!"}},{"$f":"IF(O5=\"\",\"\",VLOOKUP($L$17,給料表!$F$2:$I$1134,4,0))","v":{"$error":"#REF!"}},{"$f":"IF(K5=3,7700,IF(OR(K5=1,K5=2),INT(M5/25),\"\"))","v":{"$error":"#REF!"}},{"$f":"IF(J5=\"\",\"\",4)","v":{"$error":"#REF!"}}]
["教育（二）",{"$f":"IF(入力シート!$B$93=\"教育（二）\",入力シート!$B$93,\"\")","v":""},{"$f":"IF(B6=\"\",\"\",入力シート!$U$93)","v":""},{"$f":"IF(B6=\"\",\"\",入力シート!$AC$93)","v":""},{"$f":"IF(B6=\"\",\"\",VLOOKUP($D$16,給料表!$B$2:$C$3550,2,0))","v":""},{"$f":"IF(C6=3,7500,IF(OR(C6=1,C6=2,C6=25),INT(E6/25),\"\"))","v":""},{"$f":"IF(B6=\"\",\"\",5)","v":""},null,"教育（三）",{"$f":"IF(入力シート!#REF!=\"教育（三）\",入力シート!#REF!,\"\")","v":{"$error":"#REF!"}},{"$f":"IF(J6=\"\",\"\",入力シート!#REF!)","v":{"$error":"#REF!"}},{"$f":"IF(J6=\"\",\"\",入力シート!#REF!)","v":{"$error":"#REF!"}},{"$f":"IF(O6=\"\",\"\",VLOOKUP($L$17,給料表!$F$2:$I$1134,4,0))","v":{"$error":"#REF!"}},{"$f":"IF(K6=3,7500,IF(OR(K6=1,K6=2),INT(M6/25),\"\"))","v":{"$error":"#REF!"}},{"$f":"IF(J6=\"\",\"\",5)","v":{"$error":"#REF!"}}]
["研究",{"$f":"IF(入力シート!$B$93=\"研究\",入力シート!$B$93,\"\")","v":""},{"$f":"IF(B7=\"\",\"\",入力シート!$U$93)","v":""},{"$f":"IF(B7=\"\",\"\",入力シート!$AC$93)","v":""},{"$f":"IF(B7=\"\",\"\",VLOOKUP($D$16,給料表!$B$2:$C$3550,2,0))","v":""},null,{"$f":"IF(B7=\"\",\"\",6)","v":""},null,"研究",{"$f":"IF(入力シート!#REF!=\"研究\",入力シート!#REF!,\"\")","v":{"$error":"#REF!"}},{"$f":"IF(J7=\"\",\"\",入力シート!#REF!)","v":{"$error":"#REF!"}},{"$f":"IF(J7=\"\",\"\",入力シート!#REF!)","v":{"$error":"#REF!"}},{"$f":"IF(O7=\"\",\"\",VLOOKUP($L$17,給料表!$F$2:$I$1134,4,0))","v":{"$error":"#REF!"}},null,{"$f":"IF(J7=\"\",\"\",6)","v":{"$error":"#REF!"}}]
["技能",{"$f":"IF(入力シート!$B$93=\"技能\",入力シート!$B$93,\"\")","v":""},{"$f":"IF(B8=\"\",\"\",入力シート!$U$93)","v":""},{"$f":"IF(B8=\"\",\"\",入力シート!$AC$93)","v":""},{"$f":"IF(B8=\"\",\"\",VLOOKUP($D$16,給料表!$B$2:$C$3550,2,0))","v":""},null,{"$f":"IF(B8=\"\",\"\",10)","v":""},null,"技能",{"$f":"IF(入力シート!#REF!=\"技能\",入力シート!#REF!,\"\")","v":{"$error":"#REF!"}},{"$f":"IF(J8=\"\",\"\",入力シート!#REF!)","v":{"$error":"#REF!"}},{"$f":"IF(J8=\"\",\"\",入力シート!#REF!)","v":{"$error":"#REF!"}},{"$f":"IF(O8=\"\",\"\",VLOOKUP($L$17,給料表!$F$2:$I$1134,4,0))","v":{"$error":"#REF!"}},null,{"$f":"IF(J8=\"\",\"\",10)","v":{"$error":"#REF!"}}]
{"$rows_left_out":18}
{"sheet":"計算シート","index":9,"n_rows":44,"n_cols":14,"rows_kept":44,"cut":false,"hidden":true,"merged":[[39,3,39,9],[48,3,48,14],[6,8,6,9],[41,0,41,6],[23,3,23,9],[15,3,15,14],[17,3,17,15],[19,3,19,14]]}
["条例改正に伴う退職手当額試算シート",null,null,null,null,null,null,null,null,null,"ver3.0"]
[null,null,null,null,null,null,null,null,null,null,null,null,"自己都合"]
["１．H３０.３.３１に退職した場合",null,null,null,null,null,null,null,null,null,null,null,"定年・勧奨"]
[]
[null,null,null,"年齢(H30.3.31)",null,"※１勤続年数",null,"※２給料月額(現在)",null,"※２給料月額(H19.3.31)",null,null,{"$f":"MAX(H6:H9)","v":434616},{"$f":"IF(入力シート!AT128=0,1251000,入力シート!AZ128)","v":1626000}]
[null,null,null,{"$f":"入力シート!B21","v":23103},null,{"$f":"入力シート!AW80","v":34},null,{"$f":"入力シート!BG102","v":434616},null,{"$f":"IF(入力シート!#REF!=\"\",0,入力シート!#REF!)","v":{"$error":"#REF!"}},null,"新条例",{"$f":"IF(F9=1,VLOOKUP($F$6,'H30.4.1'!A5:C50,3,FALSE),VLOOKUP($F$6,'H30.4.1'!A5:C50,2,FALSE))","v":46.830150000000003},{"$f":"SUM(M5*M6)+N5","v":21979132.472400002}]
[null,null,null,null,null,null,null,null,"　　　",null,null,null,{"$f":"MAX(J6:J9)","v":{"$error":"#REF!"}}]
[null,null,null,"退職区分",null,null,null,"退職手当上の給料月額",null,"退職手当上の給料月額",null,"旧条例",{"$f":"IF(F6<=7,0,IF(F9=1,VLOOKUP('H193.31勤続期間'!AW46,'H19.3.31（H2７.3.31）'!A5:C50,3,FALSE),VLOOKUP('H193.31勤続期間'!AW46,'H19.3.31（H2７.3.31）'!A5:C50,2,FALSE)))","v":14.8149},{"$f":"ROUNDDOWN(M7*M8,0)","v":{"$error":"#REF!"}}]
{"$rows_left_out":37}
{"sheet":"Sheet2","index":10,"n_rows":21,"n_cols":11,"rows_kept":21,"cut":false,"hidden":true,"merged":[]}
["次年度　調整額計算"]
[]
[null,"前年度a"]
[null,null,"4号","５号","６号","7号","8号","9号","10号","合計"]
[null,null,{"$f":"入力シート!X124","v":0},{"$f":"入力シート!AD124","v":0},{"$f":"入力シート!AJ124","v":0},{"$f":"入力シート!AP124","v":0},{"$f":"入力シート!AV124","v":60},{"$f":"入力シート!BB124","v":0},{"$f":"入力シート!BH124","v":0},{"$f":"SUM(C5:I5)","v":60},{"$f":"IF(J5<60,J5+12,J5)","v":60}]
[null,"a＋12",{"$f":"IF(C5>0,C5+12,C5)","v":0},{"$f":"IF(D5>0,D5+12,D5)","v":0},{"$f":"IF(AND(D5=0,E5>0),E5+12,E5)","v":0},{"$f":"IF(AND(E5=0,F5>0),F5+12,F5)","v":0},{"$f":"IF(AND(F5=0,G5>0),G5+12,G5)","v":72},{"$f":"IF(AND(G5=0,H5>0),H5+12,H5)","v":0},{"$f":"IF(AND(H5=0,I5>0),I5+12,I5)","v":0}]
[null,null,{"$f":"IF(C6>60,60,C6)","v":0},0,0,0,60,0,0]
[null,"a-12",{"$f":"C5-12","v":-12},-12,-12,-12,48,-12,-12]
{"$rows_left_out":14}
{"sheet":"除算","index":11,"n_rows":11,"n_cols":7,"rows_kept":11,"cut":false,"hidden":true,"merged":[]}
[null,"除算１",null,null,null,"除算２"]
[]
[null,"休職",2,null,null,"休職",2]
[null,"停職",2,null,null,"停職",2]
[null,"大学院修学",2,null,null,"大学院修学",2]
[null,"育休",3,null,null,"育休",2]
[null,"育短勤務",3,null,null,"育短勤務",3]
[null,"高齢者部分休業",2,null,null,"高齢者部分休業",2]
{"$rows_left_out":4}
{"sheet":"加算率","index":12,"n_rows":34,"n_cols":3,"rows_kept":34,"cut":false,"hidden":true,"merged":[]}
[]
[]
[]
[null,30,1]
[null,31,1]
[null,32,1]
[null,33,1]
[null,34,1]
{"$rows_left_out":27}
{"sheet":"H30.4.1","index":13,"n_rows":50,"n_cols":8,"rows_kept":50,"cut":false,"hidden":true,"merged":[]}
[null,null,null,null,null,"新支給率"]
[null,null,null,"新"]
[null,"勧奨","自己都合",null,null,null,"1985-03-31",{"$f":"DATEVALUE(G3)","v":{"$error":"#VALUE!"}}]
[" 年  数"]
[0,null,0]
[1,0.83700000000000008,0.50219999999999998]
[2,1.6740000000000002,1.0044]
[3,2.5110000000000001,1.5065999999999999]
{"$rows_left_out":43}
{"sheet":"H19.3.31（H2７.3.31）","index":14,"n_rows":50,"n_cols":6,"rows_kept":50,"cut":false,"hidden":true,"merged":[]}
[]
[null,null,null,null,null,"旧２"]
[null,"勧奨","自己都合"]
[" 年  数"]
[0,null,0]
[1,0.83700000000000008,0.50219999999999998]
[2,1.6740000000000002,1.0044]
[3,2.5110000000000001,1.5065999999999999]
{"$rows_left_out":43}
{"sheet":"育休特殊事例入力方法","index":15,"n_rows":40,"n_cols":3,"rows_kept":40,"cut":false,"hidden":false,"merged":[[7,1,7,9],[0,1,1,9],[3,1,3,9],[4,1,4,9],[5,1,5,9],[6,1,6,9],[23,1,23,9],[36,2,36,9],[37,2,37,9],[39,1,41,9],[8,1,8,9],[24,1,24,9],[15,1,15,9],[16,1,16,9],[20,2,20,9],[21,2,21,9],[9,1,9,9],[10,1,10,9],[11,1,11,9],[12,1,12,9],[13,1,13,9],[14,1,14,9]]}
[null,"育児休業から復帰後、再度、同一の子の育児休業を取得した場合について"]
[]
[]
[null,"　入力シートの除算期間の子の誕生日欄は、行毎に子の誕生日が異なることを想定していますので、"]
[null,"期間を空けて同じ子の育児休業を取得した場合は、正しく計算されない事があります。"]
[null,"その場合は、お手数をおかけしますが下記のとおり入力してください。"]
[]
[null,"①子どもの１歳の誕生日を越えて、１回目の育児休業を取得した場合"]
{"$rows_left_out":32}